program: Gaussian 16
title: Title Card Required
version: ES64L-G16RevC.02
basis: 6-31+G(d,p)
method: UwB97XD TD-FC
operation: Force
keyword: #p
keyword: td=(nstates=30,root=1)
keyword: uwb97xd/6-31+g(d,p)
keyword: force
keyword: scrf=(CPCM,solvent=chloroform)
keyword: nosymm
keyword: scf=xqc
keyword: Guess=mix
keyword: density=current
title: #p td=(nstates=30,root=1) uwb97xd/6-31+g(d,p) force scrf=(CPCM,solvent
basis: NPDir=0 NMtPBC= 1 NCelOv= 1 NCel= 1 NClECP= 1 NCelD= 1
basis: NCelK= 1 NCelE2= 1 NClLst= 1 CellRange= 0.0.
basis: One-electron integrals computed using PRISM.
basis: NBasis= 859 RedAO= T EigKep= 1.06D-06 NBF= 859
basis: NBsUse= 854 1.00D-06 EigRej= 7.45D-07 NBFU= 854
converged: NO NO NO NO
hfenergy: -1479.2075956 hartree
pointgroup: C01 [X(C32H35N3O1)]
dipole: -3.8104545 -0.5307317 -3.8348917 debye
InChI: InChI=1/32C.3N.O.35H
charge 2 multiplicity 1
71 atoms
C  0.51853933 -2.62298961 -0.62894731
C  -0.56446084 -2.35495061 -1.54927197
C  -0.763269 -1.06200765 -1.95059197
C  0.10374821 -0.04042846 -1.45776703
C  1.16370831 -0.31634958 -0.57104044
C  1.39612674 -1.60067982 -0.13788585
C  -0.59194364 -4.57451533 -0.95013914
C  -1.26605352 -3.64675077 -1.76518967
H  -1.55986078 -0.75297149 -2.61503751
H  -0.06814067 0.98039284 -1.77973531
H  1.7965834 0.49252045 -0.22730983
H  2.20217136 -1.84126743 0.54246123
N  0.46830452 -3.91400189 -0.29058821
H  -0.7265558 -5.63732464 -0.8470765
C  1.28324341 -4.50449794 0.77662915
O  2.45477845 -4.24539843 0.79436653
C  0.51490238 -5.28181199 1.8009659
H  -0.12886923 -6.02757677 1.32708066
H  1.25394197 -5.80176821 2.41136581
C  -0.33417339 -4.3322753 2.69018748
H  0.30314504 -3.53120354 3.07917193
H  -0.65302527 -4.93143603 3.5491146
C  -1.5481877 -3.75804005 2.01260747
H  -2.29051143 -4.47876302 1.6706875
C  -1.76756913 -2.45680363 1.82424032
H  -1.05356537 -1.70414105 2.15282038
H  -2.67410981 -2.10277663 1.34311261
C  -2.36031189 -3.91518641 -2.55660881
H  -2.80046628 -4.90609101 -2.53944483
N  -2.94359636 -3.01905074 -3.41051151
H  -2.57049943 -2.08328717 -3.41887004
C  -2.95700756 -0.15455844 -4.99437738
C  -4.14632588 -0.64885125 -4.44830732
C  -4.8422536 0.12964481 -3.51652207
C  -4.34850628 1.37159029 -3.13048373
C  -3.15163582 1.84861249 -3.66417024
C  -2.4578868 1.08591876 -4.60003574
H  -2.41360994 -0.74240421 -5.7292214
H  -5.7709787 -0.22269912 -3.07896296
H  -4.89936496 1.96549389 -2.40926033
H  -2.76756649 2.81566886 -3.35724038
H  -1.53225397 1.45401678 -5.02960489
C  -4.59890135 -2.03761227 -4.8514605
H  -4.02340369 -2.3485911 -5.72734287
C  -4.3550336 -3.10913012 -3.73884575
H  -4.52541715 -4.09501394 -4.186622
C  -5.27393416 -2.98517079 -2.52889587
C  -6.50257352 -3.65263798 -2.5254971
C  -4.91451886 -2.23035077 -1.40859984
C  -7.37843682 -3.53085724 -1.44714469
H  -6.76992721 -4.30703055 -3.35121258
C  -5.78150684 -2.11617813 -0.32623634
H  -3.95252968 -1.72921819 -1.37393346
C  -7.0200855 -2.75697601 -0.34658364
H  -8.32752486 -4.05603494 -1.46143018
H  -5.48870336 -1.527076 0.53661365
H  -7.69320495 -2.66735786 0.49925654
C  -6.41368456 -0.88168681 -6.19698975
C  -6.43569196 -3.3231226 -6.06201973
C  -7.49647456 -1.44079862 -7.10061704
H  -5.51987378 -0.61249542 -6.76282279
H  -6.71084367 -0.04106451 -5.57351784
C  -6.97176505 -2.84209287 -7.40793547
H  -7.20533396 -3.82231831 -5.47497986
H  -5.56733098 -3.97469313 -6.14361478
H  -8.45618662 -1.48400987 -6.57633786
H  -7.61930867 -0.8229481 -7.99093801
H  -7.73915951 -3.51906905 -7.78451897
H  -6.16520124 -2.79382743 -8.1446987
N  -6.03676762 -2.05420808 -5.30251465
H  -6.62238841 -2.0056909 -4.46250662
