program: Gaussian 16
title: Title Card Required
version: ES64L-G16RevC.02
basis: 6-31+G(d,p)
method: UwB97XD TD-FC
operation: Force
keyword: #p
keyword: td=(nstates=30,root=1)
keyword: uwb97xd/6-31+g(d,p)
keyword: force
keyword: scrf=(CPCM,solvent=chloroform)
keyword: nosymm
keyword: scf=xqc
keyword: Guess=mix
keyword: density=current
title: #p td=(nstates=30,root=1) uwb97xd/6-31+g(d,p) force scrf=(CPCM,solvent
basis: NPDir=0 NMtPBC= 1 NCelOv= 1 NCel= 1 NClECP= 1 NCelD= 1
basis: NCelK= 1 NCelE2= 1 NClLst= 1 CellRange= 0.0.
basis: One-electron integrals computed using PRISM.
basis: NBasis= 859 RedAO= T EigKep= 1.06D-06 NBF= 859
basis: NBsUse= 854 1.00D-06 EigRej= 7.45D-07 NBFU= 854
converged: NO NO NO NO
hfenergy: -1479.2075836 hartree
pointgroup: C01 [X(C32H35N3O1)]
dipole: -3.78647 -0.5279242 -3.8196342 debye
InChI: InChI=1/32C.3N.O.35H
charge 2 multiplicity 1
71 atoms
C  0.51853945 -2.62326139 -0.62958397
C  -0.56490814 -2.35556834 -1.54950695
C  -0.7646902 -1.06258932 -1.95041449
C  0.1022773 -0.04077585 -1.45798142
C  1.16287514 -0.31637788 -0.57187727
C  1.39635569 -1.6006568 -0.13929982
C  -0.59246142 -4.57486482 -0.94929272
C  -1.26651288 -3.64755116 -1.76491153
H  -1.56152167 -0.75379215 -2.61459525
H  -0.07029599 0.9801375 -1.77917761
H  1.79575451 0.4927425 -0.22882982
H  2.20374446 -1.84075429 0.53963368
N  0.46807924 -3.91404633 -0.29036576
H  -0.72686199 -5.6377737 -0.84611177
C  1.28366305 -4.50442063 0.77638477
O  2.45523071 -4.2453442 0.79339791
C  0.51557236 -5.28135676 1.80120607
H  -0.12822874 -6.02782327 1.32827696
H  1.25461259 -5.8006256 2.41204804
C  -0.33364267 -4.33164018 2.68989364
H  0.30375132 -3.53057877 3.07901599
H  -0.6525215 -4.93079013 3.54873509
C  -1.54761128 -3.75761856 2.01239099
H  -2.28992631 -4.47879479 1.67082823
C  -1.76771471 -2.45654804 1.82365582
H  -1.05390402 -1.70337308 2.15164803
H  -2.67449203 -2.10316234 1.34281433
C  -2.36152045 -3.91587368 -2.55530074
H  -2.80199299 -4.9065646 -2.53787012
N  -2.94406254 -3.02009441 -3.41005774
H  -2.56995975 -2.08477234 -3.41981639
C  -2.95661315 -0.15468147 -4.99409318
C  -4.14571593 -0.6489889 -4.44793292
C  -4.84165951 0.12948115 -3.51615932
C  -4.34812705 1.37139419 -3.13023524
C  -3.15134387 1.8484814 -3.66417397
C  -2.45757736 1.08594224 -4.60003256
H  -2.41307424 -0.74259037 -5.72899899
H  -5.77042949 -0.22308763 -3.0785922
H  -4.89904144 1.96534665 -2.40905526
H  -2.76742766 2.8157889 -3.35736946
H  -1.53214111 1.45424948 -5.02992021
C  -4.59861178 -2.03767135 -4.85113432
H  -4.02292317 -2.34862683 -5.72687317
C  -4.35544099 -3.10954257 -3.73874121
H  -4.52583617 -4.09502174 -4.18706865
C  -5.27432069 -2.98562236 -2.52895559
C  -6.50293608 -3.65341222 -2.52549928
C  -4.9146645 -2.23037194 -1.40868472
C  -7.37866266 -3.53122199 -1.44698424
H  -6.76984366 -4.30789039 -3.35093457
C  -5.78173867 -2.11603197 -0.32656121
H  -3.95287087 -1.72947667 -1.37427495
C  -7.02029654 -2.75704278 -0.34672031
H  -8.32781441 -4.05628571 -1.46144763
H  -5.48917337 -1.52626786 0.53602535
H  -7.69341545 -2.66717167 0.49899659
C  -6.41337956 -0.88129807 -6.19643339
C  -6.43530985 -3.32276236 -6.06207963
C  -7.49624195 -1.44017271 -7.10020901
H  -5.51965764 -0.61198941 -6.76241188
H  -6.71035725 -0.04088599 -5.57270611
C  -6.97150632 -2.84140267 -7.40776271
H  -7.2048309 -3.82211295 -5.4749898
H  -5.56693632 -3.97435837 -6.14406832
H  -8.45609057 -1.48326911 -6.5761468
H  -7.61879052 -0.8221696 -7.99043068
H  -7.73873872 -3.51844674 -7.78455146
H  -6.16491027 -2.79274547 -8.1444839
N  -6.03636905 -2.05404619 -5.30233782
H  -6.6218864 -2.00576524 -4.46224097
