program: Gaussian 16
title: Title Card Required
version: ES64L-G16RevC.02
basis: 6-31+G(d,p)
method: UwB97XD TD-FC
operation: Force
keyword: #p
keyword: td=(nstates=30,root=1)
keyword: uwb97xd/6-31+g(d,p)
keyword: force
keyword: scrf=(CPCM,solvent=chloroform)
keyword: nosymm
keyword: scf=xqc
keyword: Guess=mix
keyword: density=current
title: #p td=(nstates=30,root=1) uwb97xd/6-31+g(d,p) force scrf=(CPCM,solvent
basis: NPDir=0 NMtPBC= 1 NCelOv= 1 NCel= 1 NClECP= 1 NCelD= 1
basis: NCelK= 1 NCelE2= 1 NClLst= 1 CellRange= 0.0.
basis: One-electron integrals computed using PRISM.
basis: NBasis= 859 RedAO= T EigKep= 1.06D-06 NBF= 859
basis: NBsUse= 854 1.00D-06 EigRej= 7.43D-07 NBFU= 854
converged: NO NO NO NO
hfenergy: -1479.2075658 hartree
pointgroup: C01 [X(C32H35N3O1)]
dipole: -3.7500279 -0.5215988 -3.7971232 debye
InChI: InChI=1/32C.3N.O.35H
charge 2 multiplicity 1
71 atoms
C  0.51777308 -2.62398525 -0.63080299
C  -0.56701003 -2.35691944 -1.54944482
C  -0.76835988 -1.0639301 -1.94976926
C  0.09906641 -0.04187185 -1.45879914
C  1.16105172 -0.31686282 -0.57426643
C  1.39632184 -1.60094588 -0.14233667
C  -0.59333389 -4.57614689 -0.94786041
C  -1.26793443 -3.64948275 -1.76377826
H  -1.56593589 -0.75489803 -2.61292808
H  -0.0746205 0.97914672 -1.779008
H  1.79443346 0.49270263 -0.2331737
H  2.20588876 -1.84038708 0.53397897
N  0.46775454 -3.91450259 -0.29050931
H  -0.72673368 -5.63916375 -0.84455207
C  1.28449137 -4.50406752 0.77594755
O  2.45610935 -4.24502992 0.79160255
C  0.51703459 -5.28012879 1.80197694
H  -0.12644772 -6.02791696 1.33107766
H  1.25658869 -5.79779218 2.41361294
C  -0.33244275 -4.32998914 2.68991429
H  0.30428595 -3.52888717 3.07916969
H  -0.65163024 -4.9293358 3.54867973
C  -1.54684011 -3.7571761 2.01177522
H  -2.28829823 -4.47892965 1.67066854
C  -1.7674187 -2.45629943 1.82253047
H  -1.05444359 -1.70238966 2.14977775
H  -2.67487122 -2.10386941 1.34142328
C  -2.36338128 -3.91757717 -2.55342383
H  -2.80492173 -4.90782449 -2.53538405
N  -2.94482219 -3.02171414 -3.40882574
H  -2.56865704 -2.08725723 -3.42064747
C  -2.95591702 -0.15501098 -4.9936957
C  -4.14469933 -0.64933985 -4.44705444
C  -4.84072096 0.12921076 -3.51521915
C  -4.34733564 1.37118903 -3.12958021
C  -3.15066958 1.84868613 -3.664073
C  -2.45698294 1.08608775 -4.60008043
H  -2.41258311 -0.7426976 -5.72867188
H  -5.76942281 -0.2233898 -3.07780198
H  -4.89810905 1.96517856 -2.40840335
H  -2.7672179 2.81607303 -3.35787352
H  -1.53204258 1.45456126 -5.03053419
C  -4.59798788 -2.03774834 -4.85040081
H  -4.02200745 -2.34856812 -5.72615671
C  -4.35562383 -3.11032528 -3.73854022
H  -4.52603554 -4.09532146 -4.1878148
C  -5.27489386 -2.98666158 -2.5287786
C  -6.50289445 -3.65471266 -2.52504206
C  -4.91530985 -2.23069436 -1.40903465
C  -7.37876508 -3.53208507 -1.44670529
H  -6.76966378 -4.3097095 -3.35050863
C  -5.7822258 -2.11560866 -0.32722547
H  -3.95350208 -1.72920045 -1.37489967
C  -7.02071556 -2.75708033 -0.34716284
H  -8.32799193 -4.05706435 -1.46135189
H  -5.49033512 -1.52459589 0.53478242
H  -7.69426383 -2.66637612 0.49828235
C  -6.41255471 -0.88053022 -6.19527835
C  -6.43445504 -3.32201683 -6.06233042
C  -7.49566022 -1.43880374 -7.09928701
H  -5.51904293 -0.61115735 -6.76133374
H  -6.70925248 -0.04042304 -5.57100413
C  -6.97090292 -2.83990553 -7.40753332
H  -7.20383978 -3.82186158 -5.47531201
H  -5.56603069 -3.97353068 -6.14492277
H  -8.45566207 -1.48183448 -6.5756756
H  -7.61764298 -0.82033603 -7.98928039
H  -7.73791893 -3.51686751 -7.78473686
H  -6.1642745 -2.79052015 -8.14426606
N  -6.03565719 -2.05380703 -5.30173845
H  -6.62096389 -2.00603083 -4.46171907
