program: Gaussian 16
title: Title Card Required
version: ES64L-G16RevC.02
basis: 6-31+G(d,p)
method: UwB97XD TD-FC
operation: Force
keyword: #p
keyword: td=(nstates=30,root=1)
keyword: uwb97xd/6-31+g(d,p)
keyword: force
keyword: scrf=(CPCM,solvent=chloroform)
keyword: nosymm
keyword: scf=xqc
keyword: Guess=mix
keyword: density=current
title: #p td=(nstates=30,root=1) uwb97xd/6-31+g(d,p) force scrf=(CPCM,solvent
basis: NPDir=0 NMtPBC= 1 NCelOv= 1 NCel= 1 NClECP= 1 NCelD= 1
basis: NCelK= 1 NCelE2= 1 NClLst= 1 CellRange= 0.0.
basis: One-electron integrals computed using PRISM.
basis: NBasis= 859 RedAO= T EigKep= 1.06D-06 NBF= 859
basis: NBsUse= 854 1.00D-06 EigRej= 7.42D-07 NBFU= 854
converged: NO NO NO NO
hfenergy: -1479.2075535 hartree
pointgroup: C01 [X(C32H35N3O1)]
dipole: -3.7188744 -0.5146823 -3.7779737 debye
InChI: InChI=1/32C.3N.O.35H
charge 2 multiplicity 1
71 atoms
C  0.51659535 -2.62488093 -0.63214074
C  -0.56991033 -2.35849605 -1.5489978
C  -0.77283404 -1.06556117 -1.9488816
C  0.09523124 -0.04315547 -1.45988117
C  1.15908307 -0.31758636 -0.57746649
C  1.39593806 -1.60141913 -0.14598059
C  -0.59410054 -4.57766117 -0.9465583
C  -1.27006978 -3.65181438 -1.76217015
H  -1.57166477 -0.75594382 -2.61041944
H  -0.07954306 0.97775268 -1.7795329
H  1.7931895 0.49248923 -0.23871776
H  2.20771272 -1.84040464 0.52779246
N  0.46773331 -3.91513393 -0.29102921
H  -0.72627553 -5.6409884 -0.84278178
C  1.28538306 -4.50367108 0.77546931
O  2.45697142 -4.24466688 0.78989365
C  0.51886911 -5.27852737 1.80318751
H  -0.1241807 -6.02807922 1.33447382
H  1.25931665 -5.79428317 2.41545471
C  -0.33133095 -4.32828567 2.69015633
H  0.30478236 -3.52662476 3.07960703
H  -0.6507144 -4.9274481 3.54893667
C  -1.54563643 -3.75664989 2.01115512
H  -2.28635755 -4.47924013 1.67009246
C  -1.76721235 -2.45606896 1.82101907
H  -1.05486294 -1.70144023 2.14784305
H  -2.67497604 -2.10474946 1.33964109
C  -2.36519013 -3.92001993 -2.55173939
H  -2.80792168 -4.90936497 -2.53308926
N  -2.94521054 -3.02353648 -3.40723132
H  -2.56697884 -2.0900077 -3.42122251
C  -2.95518211 -0.15511024 -4.99309052
C  -4.14368721 -0.64975603 -4.44589284
C  -4.83957995 0.12899659 -3.5140962
C  -4.34619809 1.37110631 -3.12886928
C  -3.15007564 1.8487692 -3.66399562
C  -2.45655242 1.08617507 -4.60008894
H  -2.41227942 -0.74274669 -5.72848614
H  -5.76843165 -0.22347342 -3.07683294
H  -4.89692524 1.96512128 -2.40751611
H  -2.76689348 2.81663976 -3.35847452
H  -1.53194076 1.4548981 -5.03128983
C  -4.59708763 -2.03794496 -4.84964287
H  -4.02103536 -2.34841993 -5.72534285
C  -4.35584825 -3.11123265 -3.73823318
H  -4.52610104 -4.09584839 -4.18852258
C  -5.27493505 -2.98790103 -2.52872325
C  -6.50289464 -3.65650823 -2.52452712
C  -4.91580566 -2.23090543 -1.40928265
C  -7.37866071 -3.53311343 -1.44637207
H  -6.76942457 -4.31158347 -3.34984309
C  -5.78318797 -2.11520641 -0.32791175
H  -3.95451714 -1.72856343 -1.37559558
C  -7.02120519 -2.75701867 -0.34755725
H  -8.32809418 -4.05807087 -1.4611637
H  -5.49186965 -1.52256104 0.53333844
H  -7.69545627 -2.66533055 0.4974015
C  -6.41170949 -0.87966819 -6.19391592
C  -6.43347446 -3.32118275 -6.06260667
C  -7.49488083 -1.43715564 -7.09827901
H  -5.51827343 -0.61024319 -6.76011978
H  -6.70799032 -0.03980569 -5.56911387
C  -6.9701266 -2.83806657 -7.40740922
H  -7.20267372 -3.82158604 -5.47585872
H  -5.56495596 -3.97243689 -6.14586602
H  -8.45520426 -1.48022028 -6.5751144
H  -7.61634137 -0.81815686 -7.9879558
H  -7.73700803 -3.51495503 -7.78505058
H  -6.16359106 -2.78789465 -8.14411132
N  -6.03476155 -2.05350376 -5.30114602
H  -6.62005354 -2.00632919 -4.46106113
