program: Gaussian 16
title: Title Card Required
version: ES64L-G16RevC.02
basis: 6-31+G(d,p)
method: UwB97XD TD-FC
operation: Force
keyword: #p
keyword: td=(nstates=30,root=2)
keyword: uwb97xd/6-31+g(d,p)
keyword: force
keyword: scrf=(CPCM,solvent=chloroform)
keyword: nosymm
keyword: scf=xqc
keyword: Guess=mix
keyword: density=current
title: #p td=(nstates=30,root=2) uwb97xd/6-31+g(d,p) force scrf=(CPCM,solvent
basis: NPDir=0 NMtPBC= 1 NCelOv= 1 NCel= 1 NClECP= 1 NCelD= 1
basis: NCelK= 1 NCelE2= 1 NClLst= 1 CellRange= 0.0.
basis: One-electron integrals computed using PRISM.
basis: NBasis= 859 RedAO= T EigKep= 1.06D-06 NBF= 859
basis: NBsUse= 854 1.00D-06 EigRej= 7.35D-07 NBFU= 854
converged: NO NO NO NO
hfenergy: -1479.2074771 hartree
pointgroup: C01 [X(C32H35N3O1)]
dipole: -1.8545833 0.3542893 -2.6431017 debye
InChI: InChI=1/32C.3N.O.35H
charge 2 multiplicity 1
71 atoms
C  0.51366926 -2.6268416 -0.6344625
C  -0.57660856 -2.36191574 -1.5470856
C  -0.78253819 -1.0692102 -1.94595421
C  0.08751775 -0.04585748 -1.46233545
C  1.15585831 -0.3192429 -0.5856216
C  1.3945211 -1.60276591 -0.15343661
C  -0.59619497 -4.58157349 -0.94383382
C  -1.27474935 -3.65635716 -1.75851225
H  -1.58451978 -0.75943015 -2.60427809
H  -0.08992368 0.97459072 -1.7821383
H  1.79187899 0.49098458 -0.25095317
H  2.20956497 -1.84216807 0.51639473
N  0.46749635 -3.91692355 -0.2922398
H  -0.72425754 -5.64558305 -0.84118149
C  1.28715483 -4.5020113 0.77473259
O  2.45894536 -4.24361104 0.7860445
C  0.52280216 -5.27418378 1.80612847
H  -0.11866936 -6.02664149 1.34022091
H  1.26576871 -5.78629523 2.41885005
C  -0.32967109 -4.32468456 2.69180191
H  0.30414806 -3.52087705 3.08102911
H  -0.64860295 -4.92326394 3.551067
C  -1.54390096 -3.75618088 2.01063236
H  -2.2828685 -4.48048569 1.66854869
C  -1.76658898 -2.45608411 1.81822059
H  -1.05546142 -1.7007854 2.14580165
H  -2.67336764 -2.10616876 1.33402621
C  -2.36921074 -3.92418901 -2.54874908
H  -2.81383452 -4.91276635 -2.53141043
N  -2.945481 -3.02691753 -3.40544859
H  -2.56545884 -2.09429643 -3.41918477
C  -2.95419389 -0.15537287 -4.99216128
C  -4.1421293 -0.65018112 -4.44364918
C  -4.83763214 0.12886268 -3.51169494
C  -4.34405471 1.37107488 -3.12746252
C  -3.14891071 1.84915386 -3.66396872
C  -2.45584964 1.0864189 -4.60019604
H  -2.41217368 -0.7426825 -5.72815592
H  -5.76652144 -0.22317414 -3.07420099
H  -4.89430671 1.96519291 -2.40557301
H  -2.76618237 2.81767646 -3.3598099
H  -1.53184346 1.45523259 -5.03255745
C  -4.59573424 -2.03813233 -4.84812456
H  -4.01989801 -2.34804074 -5.7240924
C  -4.35581951 -3.11227485 -3.73785889
H  -4.52548347 -4.09663526 -4.18877427
C  -5.27491168 -2.98954425 -2.52864937
C  -6.50209298 -3.65936913 -2.52379795
C  -4.9169462 -2.23080367 -1.4100818
C  -7.37840138 -3.53512635 -1.44630044
H  -6.76821094 -4.31569539 -3.34867267
C  -5.78499669 -2.11378972 -0.32938766
H  -3.95612813 -1.72715787 -1.37701389
C  -7.02232284 -2.75641575 -0.34905262
H  -8.32747118 -4.06117401 -1.46033426
H  -5.49433711 -1.51913081 0.53078088
H  -7.6977972 -2.66256153 0.49502336
C  -6.40936295 -0.87813616 -6.19096744
C  -6.43159352 -3.31977761 -6.06339018
C  -7.4926564 -1.43378753 -7.09614336
H  -5.51563497 -0.60873382 -6.75664628
H  -6.70507084 -0.03885643 -5.56516005
C  -6.96834554 -2.83441179 -7.40739135
H  -7.20050251 -3.82160832 -5.47749361
H  -5.56267991 -3.97047934 -6.14765488
H  -8.4530132 -1.47733383 -6.57312841
H  -7.6136865 -0.81324985 -7.98478608
H  -7.735699 -3.51039444 -7.78595739
H  -6.16203308 -2.78345971 -8.14418899
N  -6.0333132 -2.05321984 -5.29962767
H  -6.61855527 -2.00742567 -4.45970845
