program: Gaussian 16
title: Title Card Required
version: ES64L-G16RevC.02
basis: 6-31+G(d,p)
method: UwB97XD TD-FC
operation: Force
keyword: #p
keyword: td=(nstates=30,root=2)
keyword: uwb97xd/6-31+g(d,p)
keyword: force
keyword: scrf=(CPCM,solvent=chloroform)
keyword: nosymm
keyword: scf=xqc
keyword: Guess=mix
keyword: density=current
title: #p td=(nstates=30,root=2) uwb97xd/6-31+g(d,p) force scrf=(CPCM,solvent
basis: NPDir=0 NMtPBC= 1 NCelOv= 1 NCel= 1 NClECP= 1 NCelD= 1
basis: NCelK= 1 NCelE2= 1 NClLst= 1 CellRange= 0.0.
basis: One-electron integrals computed using PRISM.
basis: NBasis= 859 RedAO= T EigKep= 1.05D-06 NBF= 859
basis: NBsUse= 854 1.00D-06 EigRej= 7.28D-07 NBFU= 854
converged: NO NO NO NO
hfenergy: -1479.2074065 hartree
pointgroup: C01 [X(C32H35N3O1)]
dipole: -1.9853112 0.3440896 -2.7297761 debye
InChI: InChI=1/32C.3N.O.35H
charge 2 multiplicity 1
71 atoms
C  0.50987787 -2.62933633 -0.63714725
C  -0.58464669 -2.36606607 -1.5447502
C  -0.794094 -1.07352805 -1.94305077
C  0.07812292 -0.04974972 -1.46504742
C  1.15272556 -0.32202675 -0.59553028
C  1.39298123 -1.6048157 -0.16218786
C  -0.59768652 -4.58576967 -0.94138911
C  -1.28051313 -3.66152692 -1.75343657
H  -1.60026248 -0.76374104 -2.59609462
H  -0.10124606 0.96994596 -1.78647499
H  1.79073149 0.4882826 -0.26537698
H  2.2101224 -1.84456852 0.5047989
N  0.46711069 -3.91910893 -0.29369705
H  -0.72126576 -5.65028019 -0.84025937
C  1.28899613 -4.49977689 0.77424977
O  2.46097171 -4.24210497 0.78176611
C  0.52773147 -5.26895222 1.81030836
H  -0.11167384 -6.02449167 1.34643159
H  1.2735915 -5.77709938 2.42279753
C  -0.32789425 -4.32053917 2.69416382
H  0.3026637 -3.51389293 3.08276908
H  -0.64614944 -4.91832738 3.55430605
C  -1.54231357 -3.75602232 2.00974422
H  -2.27892668 -4.48200851 1.66625582
C  -1.76579445 -2.45649806 1.81495263
H  -1.05593555 -1.7006904 2.14463101
H  -2.67052524 -2.10755639 1.32656802
C  -2.37326402 -3.9289806 -2.54603512
H  -2.82055685 -4.91664426 -2.52916183
N  -2.94520977 -3.03055927 -3.40428503
H  -2.56281005 -2.09868818 -3.41724358
C  -2.9536791 -0.15523883 -4.99115111
C  -4.14074272 -0.65037358 -4.44121052
C  -4.8354803 0.12897372 -3.50903609
C  -4.34177281 1.37150264 -3.12551604
C  -3.14750375 1.84992136 -3.66382605
C  -2.45519825 1.08681478 -4.60042261
H  -2.41256667 -0.74239822 -5.72806525
H  -5.76432252 -0.22236611 -3.07074226
H  -4.891166 1.96566165 -2.40317535
H  -2.76534651 2.81916843 -3.36138056
H  -1.53192202 1.4556756 -5.03402466
C  -4.5943758 -2.03844117 -4.84636372
H  -4.01866746 -2.34747753 -5.72273764
C  -4.35501097 -3.11377844 -3.7374808
H  -4.5252308 -4.0980442 -4.18875156
C  -5.27476858 -2.99084957 -2.52863318
C  -6.50094537 -3.66250612 -2.52332568
C  -4.91819909 -2.23001778 -1.41119217
C  -7.37817195 -3.53761683 -1.4463797
H  -6.76626394 -4.3202021 -3.34715216
C  -5.78713953 -2.11166879 -0.33103828
H  -3.95824452 -1.72506872 -1.37851963
C  -7.02425734 -2.75546538 -0.35037922
H  -8.3259583 -4.0652297 -1.45920575
H  -5.49758183 -1.51553564 0.52804828
H  -7.70085709 -2.65928546 0.49198474
C  -6.40666611 -0.87645589 -6.18746378
C  -6.42942934 -3.31825794 -6.06425433
C  -7.48979163 -1.429986 -7.09377004
H  -5.51226684 -0.60717922 -6.75227022
H  -6.70181568 -0.03766921 -5.56071142
C  -6.9661759 -2.83031554 -7.40753581
H  -7.19807663 -3.82188856 -5.47955915
H  -5.56008283 -3.96816268 -6.14948654
H  -8.44993215 -1.47442714 -6.57039536
H  -7.61082162 -0.80759 -7.98106953
H  -7.73421964 -3.50487693 -7.78705089
H  -6.16004999 -2.77885992 -8.14461814
N  -6.03176052 -2.05296547 -5.29801063
H  -6.617475 -2.00865868 -4.45803973
