program: Gaussian 16
title: Title Card Required
version: ES64L-G16RevC.02
basis: 6-31+G(d,p)
method: UwB97XD TD-FC
operation: Force
keyword: #p
keyword: td=(nstates=30,root=2)
keyword: uwb97xd/6-31+g(d,p)
keyword: force
keyword: scrf=(CPCM,solvent=chloroform)
keyword: nosymm
keyword: scf=xqc
keyword: Guess=mix
keyword: density=current
title: #p td=(nstates=30,root=2) uwb97xd/6-31+g(d,p) force scrf=(CPCM,solvent
basis: NPDir=0 NMtPBC= 1 NCelOv= 1 NCel= 1 NClECP= 1 NCelD= 1
basis: NCelK= 1 NCelE2= 1 NClLst= 1 CellRange= 0.0.
basis: One-electron integrals computed using PRISM.
basis: NBasis= 859 RedAO= T EigKep= 1.05D-06 NBF= 859
basis: NBsUse= 854 1.00D-06 EigRej= 7.24D-07 NBFU= 854
converged: NO NO NO NO
hfenergy: -1479.2073084 hartree
pointgroup: C01 [X(C32H35N3O1)]
dipole: -1.9162417 0.3518643 -2.6872579 debye
InChI: InChI=1/32C.3N.O.35H
charge 2 multiplicity 1
71 atoms
C  0.50912922 -2.63135257 -0.63872191
C  -0.58627353 -2.36946653 -1.54526047
C  -0.79996453 -1.07696402 -1.94146142
C  0.07406134 -0.0530067 -1.46793183
C  1.15071355 -0.32405118 -0.60019356
C  1.392207 -1.60582833 -0.16537798
C  -0.59947077 -4.58797275 -0.93862913
C  -1.28194614 -3.66539695 -1.75273504
H  -1.61131067 -0.76872331 -2.58810211
H  -0.10585048 0.96653686 -1.78899419
H  1.79027846 0.48668249 -0.27461809
H  2.2107023 -1.84255198 0.50100304
N  0.46571693 -3.92028171 -0.29268648
H  -0.71992788 -5.65323329 -0.8398463
C  1.29027452 -4.49837767 0.77428277
O  2.46195696 -4.23927186 0.77795971
C  0.53111095 -5.26642632 1.81269396
H  -0.10673092 -6.02413038 1.35010567
H  1.27692511 -5.77198659 2.42711826
C  -0.32676642 -4.3182829 2.69456427
H  0.30230605 -3.51012172 3.08239422
H  -0.64408046 -4.91598395 3.5552753
C  -1.54122272 -3.75598696 2.00855088
H  -2.27630996 -4.48295719 1.66388965
C  -1.76521453 -2.45671856 1.81286386
H  -1.05683037 -1.70063335 2.14523251
H  -2.66794295 -2.10788437 1.32076255
C  -2.37514877 -3.93281528 -2.54444667
H  -2.82401241 -4.91951374 -2.52432271
N  -2.94627269 -3.03438505 -3.4037709
H  -2.55943582 -2.10481301 -3.4231255
C  -2.9537979 -0.15433737 -4.99075027
C  -4.13995693 -0.65007816 -4.43953598
C  -4.83419519 0.12952594 -3.50695965
C  -4.34068394 1.37257986 -3.12426373
C  -3.14669466 1.85105263 -3.66383096
C  -2.45525528 1.08790256 -4.60096609
H  -2.41311711 -0.741611 -5.7281458
H  -5.76222079 -0.22202202 -3.06741899
H  -4.88959593 1.96680446 -2.401896
H  -2.76427623 2.82018194 -3.36148802
H  -1.53247074 1.45706348 -5.03565497
C  -4.59395433 -2.03797258 -4.84472974
H  -4.01784069 -2.34655327 -5.72122642
C  -4.3561212 -3.11454622 -3.73688628
H  -4.52952555 -4.09760977 -4.18941701
C  -5.27566259 -2.99027921 -2.52831263
C  -6.50072534 -3.66363287 -2.52306574
C  -4.91980853 -2.2280808 -1.41170222
C  -7.37837853 -3.53865813 -1.44675241
H  -6.76307627 -4.32342645 -3.34616509
C  -5.7894943 -2.10935966 -0.33254745
H  -3.95946713 -1.72328959 -1.37882479
C  -7.02592536 -2.75441885 -0.35189105
H  -8.3246336 -4.06900032 -1.45921954
H  -5.50113573 -1.51282509 0.5269184
H  -7.70289776 -2.65911626 0.49034398
C  -6.40503614 -0.87527924 -6.18569065
C  -6.4281112 -3.31726288 -6.06466007
C  -7.48803584 -1.42811296 -7.09246556
H  -5.51019202 -0.60549365 -6.74944996
H  -6.70054011 -0.03705374 -5.55823131
C  -6.96457974 -2.82818935 -7.40757954
H  -7.19660683 -3.82182923 -5.48055598
H  -5.55854582 -3.9669 -6.15063717
H  -8.44764802 -1.47350772 -6.56834175
H  -7.60996189 -0.80469891 -7.97895129
H  -7.73292472 -3.50211786 -7.78760746
H  -6.15832291 -2.776695 -8.1445102
N  -6.03093979 -2.05253225 -5.297218
H  -6.61739262 -2.00898279 -4.45752274
