program: Gaussian 16
title: Title Card Required
version: ES64L-G16RevC.02
basis: 6-31+G(d,p)
method: UwB97XD TD-FC
operation: Force
keyword: #p
keyword: td=(nstates=30,root=2)
keyword: uwb97xd/6-31+g(d,p)
keyword: force
keyword: scrf=(CPCM,solvent=chloroform)
keyword: nosymm
keyword: scf=xqc
keyword: Guess=mix
keyword: density=current
title: #p td=(nstates=30,root=2) uwb97xd/6-31+g(d,p) force scrf=(CPCM,solvent
basis: NPDir=0 NMtPBC= 1 NCelOv= 1 NCel= 1 NClECP= 1 NCelD= 1
basis: NCelK= 1 NCelE2= 1 NClLst= 1 CellRange= 0.0.
basis: One-electron integrals computed using PRISM.
basis: NBasis= 859 RedAO= T EigKep= 1.05D-06 NBF= 859
basis: NBsUse= 854 1.00D-06 EigRej= 7.21D-07 NBFU= 854
converged: NO NO NO NO
hfenergy: -1479.2072182 hartree
pointgroup: C01 [X(C32H35N3O1)]
dipole: -1.9148615 0.3528459 -2.6894826 debye
InChI: InChI=1/32C.3N.O.35H
charge 2 multiplicity 1
71 atoms
C  0.50926996 -2.63261205 -0.63946245
C  -0.58769156 -2.37155109 -1.54473308
C  -0.80337197 -1.07899335 -1.93964482
C  0.07193468 -0.05455805 -1.47017853
C  1.15034037 -0.32477866 -0.60384736
C  1.39166203 -1.6056988 -0.16690276
C  -0.59926785 -4.58960012 -0.93776661
C  -1.28310163 -3.66778796 -1.75123275
H  -1.61955839 -0.77198423 -2.58069522
H  -0.10816631 0.96461483 -1.79284829
H  1.79080618 0.48649772 -0.28083335
H  2.20975864 -1.84129207 0.50023294
N  0.46634987 -3.92137022 -0.29288014
H  -0.71958077 -5.65461755 -0.83788739
C  1.29113418 -4.49828003 0.77477308
O  2.46251956 -4.23805178 0.77845961
C  0.5331712 -5.26579524 1.81461423
H  -0.10319227 -6.02592053 1.35355368
H  1.28010847 -5.768387 2.42997569
C  -0.32561974 -4.31699187 2.69471086
H  0.30296413 -3.50849336 3.08208467
H  -0.64352032 -4.91400843 3.55571765
C  -1.53986464 -3.75557354 2.00713408
H  -2.27386873 -4.48305192 1.66164897
C  -1.76457208 -2.45646818 1.81123633
H  -1.05725508 -1.69997312 2.14462598
H  -2.66712104 -2.10860086 1.3180388
C  -2.37560597 -3.93626843 -2.5440434
H  -2.82386332 -4.92332052 -2.52457709
N  -2.94671552 -3.03814556 -3.40413023
H  -2.5561703 -2.11007046 -3.42829989
C  -2.9537285 -0.15381542 -4.99028212
C  -4.13930433 -0.64997026 -4.43792083
C  -4.83327753 0.12998414 -3.50529511
C  -4.33968811 1.37329729 -3.12362094
C  -3.1462048 1.85182064 -3.66384134
C  -2.45559312 1.08871977 -4.60117463
H  -2.41386484 -0.74080642 -5.72834389
H  -5.76112564 -0.22130588 -3.06546138
H  -4.88849415 1.96793405 -2.40115658
H  -2.76329343 2.82093177 -3.36134438
H  -1.53313787 1.45817277 -5.03703518
C  -4.59348007 -2.0377836 -4.8436143
H  -4.01702895 -2.34598768 -5.71998694
C  -4.3567988 -3.11531658 -3.73635506
H  -4.53384864 -4.09756131 -4.18975874
C  -5.27571897 -2.99045435 -2.5275978
C  -6.50024286 -3.66458145 -2.52228844
C  -4.92092203 -2.22707038 -1.4113509
C  -7.37883309 -3.53974103 -1.44662436
H  -6.76151483 -4.32491521 -3.34527961
C  -5.79157251 -2.10787088 -0.33281895
H  -3.96102445 -1.72140057 -1.37857836
C  -7.02756123 -2.7543153 -0.35213085
H  -8.32437175 -4.07077726 -1.45925768
H  -5.5047971 -1.5100911 0.52590465
H  -7.70462023 -2.65960928 0.48992654
C  -6.40474947 -0.87411133 -6.18498933
C  -6.42736474 -3.31624386 -6.06505836
C  -7.48762814 -1.42688843 -7.09208851
H  -5.50984146 -0.60397379 -6.7489198
H  -6.70029992 -0.03632203 -5.55739804
C  -6.96379737 -2.82666754 -7.40784802
H  -7.19557244 -3.82121002 -5.48121564
H  -5.55755237 -3.96558567 -6.15149332
H  -8.44726088 -1.47277315 -6.56789276
H  -7.60988856 -0.80320741 -7.97829305
H  -7.7318378 -3.50075258 -7.78825669
H  -6.15750199 -2.77449517 -8.14461349
N  -6.03028924 -2.05177199 -5.29716794
H  -6.61735845 -2.00861219 -4.4576588
