program: Gaussian 16
title: Title Card Required
version: ES64L-G16RevC.02
basis: 6-31+G(d,p)
method: UwB97XD TD-FC
operation: Force
keyword: #p
keyword: td=(nstates=30,root=1)
keyword: uwb97xd/6-31+g(d,p)
keyword: force
keyword: scrf=(CPCM,solvent=chloroform)
keyword: nosymm
keyword: scf=xqc
keyword: Guess=mix
keyword: density=current
title: #p td=(nstates=30,root=1) uwb97xd/6-31+g(d,p) force scrf=(CPCM,solvent
basis: NPDir=0 NMtPBC= 1 NCelOv= 1 NCel= 1 NClECP= 1 NCelD= 1
basis: NCelK= 1 NCelE2= 1 NClLst= 1 CellRange= 0.0.
basis: One-electron integrals computed using PRISM.
basis: NBasis= 859 RedAO= T EigKep= 1.05D-06 NBF= 859
basis: NBsUse= 854 1.00D-06 EigRej= 7.21D-07 NBFU= 854
converged: NO NO NO NO
hfenergy: -1479.2071849 hartree
pointgroup: C01 [X(C32H35N3O1)]
dipole: -3.8791431 -0.5366146 -3.8838915 debye
InChI: InChI=1/32C.3N.O.35H
charge 2 multiplicity 1
71 atoms
C  0.50943855 -2.63273265 -0.63932689
C  -0.58819077 -2.37191805 -1.54405311
C  -0.80382925 -1.07986821 -1.93901557
C  0.07130606 -0.05448028 -1.47049984
C  1.15042533 -0.32459737 -0.60498756
C  1.39131238 -1.60547201 -0.16727778
C  -0.59899106 -4.59010779 -0.9375305
C  -1.28388715 -3.66811606 -1.75042682
H  -1.62150342 -0.7735013 -2.57883893
H  -0.10911399 0.96407695 -1.79436777
H  1.79131001 0.48674167 -0.28221456
H  2.20924785 -1.8418161 0.49986701
N  0.46704331 -3.92154489 -0.29304761
H  -0.71961989 -5.65509304 -0.83682159
C  1.29134394 -4.49828222 0.77499878
O  2.46273748 -4.23810165 0.77895075
C  0.53382997 -5.26561266 1.81502368
H  -0.10205576 -6.02634853 1.35404971
H  1.2812722 -5.76741775 2.43034987
C  -0.3255375 -4.31669953 2.69472038
H  0.30324663 -3.50794367 3.08222299
H  -0.64352482 -4.91325343 3.5558338
C  -1.53941648 -3.75544931 2.00673543
H  -2.27308384 -4.48291388 1.66083373
C  -1.76437142 -2.45639055 1.81072869
H  -1.05724544 -1.69969731 2.14427007
H  -2.66720065 -2.10887877 1.31748153
C  -2.37585666 -3.93713416 -2.54378781
H  -2.82402888 -4.92426754 -2.5257897
N  -2.94674214 -3.03945387 -3.4039544
H  -2.55474331 -2.11190598 -3.42982183
C  -2.95376647 -0.15387986 -4.99009497
C  -4.13903318 -0.64998471 -4.4372743
C  -4.83284842 0.13018304 -3.50484895
C  -4.33944217 1.37339088 -3.12353787
C  -3.14627801 1.85226243 -3.66382729
C  -2.45541598 1.0890835 -4.60144579
H  -2.41412428 -0.7404628 -5.72841924
H  -5.76098838 -0.22100851 -3.06500291
H  -4.88798239 1.96812204 -2.40086259
H  -2.76306997 2.82115282 -3.36139004
H  -1.53354331 1.45836926 -5.03716913
C  -4.59321733 -2.0376917 -4.84350736
H  -4.01695483 -2.34585094 -5.71979141
C  -4.35687135 -3.11571564 -3.7364813
H  -4.5348375 -4.09763545 -4.18964671
C  -5.27557183 -2.99069325 -2.52727347
C  -6.4999729 -3.6648593 -2.52204536
C  -4.9212397 -2.22683956 -1.41112907
C  -7.37881676 -3.53995354 -1.44660045
H  -6.76138657 -4.32518232 -3.34489348
C  -5.79235864 -2.10760004 -0.33295272
H  -3.96172066 -1.7208704 -1.37865929
C  -7.02820568 -2.75442617 -0.3522054
H  -8.32455055 -4.07135262 -1.45900258
H  -5.50580727 -1.5093156 0.52572986
H  -7.70529901 -2.65964194 0.49000724
C  -6.40458473 -0.87381159 -6.18498475
C  -6.42702533 -3.31590212 -6.0652578
C  -7.48765331 -1.42656074 -7.09199391
H  -5.50992458 -0.60356389 -6.74889098
H  -6.70036939 -0.03598725 -5.55730218
C  -6.96367854 -2.82624716 -7.40793495
H  -7.19531361 -3.82105996 -5.48135102
H  -5.55723643 -3.96502006 -6.15158301
H  -8.44728761 -1.4725693 -6.56792375
H  -7.60994919 -0.80280756 -7.97821094
H  -7.73152458 -3.50037358 -7.78850636
H  -6.15728247 -2.77379644 -8.1446512
N  -6.03026985 -2.05148995 -5.29686843
H  -6.61724742 -2.00849125 -4.45785809
