program: Gaussian 16
title: Title Card Required
version: ES64L-G16RevC.02
basis: 6-31+G(d,p)
method: UwB97XD TD-FC
operation: Force
keyword: #p
keyword: td=(nstates=30,root=1)
keyword: uwb97xd/6-31+g(d,p)
keyword: force
keyword: scrf=(CPCM,solvent=chloroform)
keyword: nosymm
keyword: scf=xqc
keyword: Guess=mix
keyword: density=current
title: #p td=(nstates=30,root=1) uwb97xd/6-31+g(d,p) force scrf=(CPCM,solvent
basis: NPDir=0 NMtPBC= 1 NCelOv= 1 NCel= 1 NClECP= 1 NCelD= 1
basis: NCelK= 1 NCelE2= 1 NClLst= 1 CellRange= 0.0.
basis: One-electron integrals computed using PRISM.
basis: NBasis= 859 RedAO= T EigKep= 1.05D-06 NBF= 859
basis: NBsUse= 854 1.00D-06 EigRej= 7.19D-07 NBFU= 854
converged: NO NO NO NO
hfenergy: -1479.2070859 hartree
pointgroup: C01 [X(C32H35N3O1)]
dipole: -3.7200084 -0.3638236 -3.7954284 debye
InChI: InChI=1/32C.3N.O.35H
charge 2 multiplicity 1
71 atoms
C  0.50880119 -2.63262821 -0.63877137
C  -0.58908711 -2.37127215 -1.54320744
C  -0.80532449 -1.07935751 -1.93708579
C  0.07190127 -0.05447257 -1.47111062
C  1.15146189 -0.32473789 -0.60622028
C  1.39060852 -1.60537859 -0.16696411
C  -0.59902703 -4.59040382 -0.93827248
C  -1.28343905 -3.66818076 -1.75115328
H  -1.62377221 -0.77166377 -2.57503565
H  -0.10721388 0.96397674 -1.79618213
H  1.79287266 0.48610023 -0.28480419
H  2.2078561 -1.8408983 0.50174753
N  0.46660521 -3.92175016 -0.2929865
H  -0.71891469 -5.65547805 -0.8383235
C  1.29063182 -4.49829363 0.77542901
O  2.46186273 -4.2371134 0.77994707
C  0.53352354 -5.26567198 1.81570372
H  -0.10205632 -6.02717944 1.3557035
H  1.28162334 -5.76674683 2.43148135
C  -0.32569842 -4.31699872 2.69552289
H  0.30349439 -3.50794799 3.08268338
H  -0.64340805 -4.91329307 3.55659687
C  -1.53941955 -3.75548808 2.00752001
H  -2.27324207 -4.48310521 1.66182054
C  -1.76399315 -2.45638686 1.81108247
H  -1.05700154 -1.6999055 2.14439053
H  -2.66679749 -2.10894811 1.31739206
C  -2.37390776 -3.93814766 -2.54703355
H  -2.8176139 -4.92746785 -2.53375272
N  -2.9462434 -3.03948833 -3.40591729
H  -2.56057169 -2.10708355 -3.42033876
C  -2.9539232 -0.15429811 -4.98998471
C  -4.13941274 -0.65024845 -4.43750814
C  -4.83328713 0.1299053 -3.50517636
C  -4.33970018 1.37346087 -3.12355166
C  -3.14601894 1.85166568 -3.66379234
C  -2.45525551 1.08827528 -4.60143881
H  -2.41418756 -0.74142049 -5.7280793
H  -5.76139128 -0.22096667 -3.06529769
H  -4.88817667 1.96816966 -2.40166745
H  -2.76251072 2.82029496 -3.36102494
H  -1.53344528 1.45745034 -5.03708305
C  -4.59364867 -2.03778899 -4.84346715
H  -4.01699924 -2.34628808 -5.71975089
C  -4.35707055 -3.1158532 -3.73654974
H  -4.53494073 -4.09747569 -4.18934533
C  -5.2750326 -2.99051009 -2.52677234
C  -6.49972087 -3.66448257 -2.52196996
C  -4.92054326 -2.22710449 -1.41079716
C  -7.37842233 -3.53947765 -1.44657349
H  -6.76112554 -4.32449943 -3.34492477
C  -5.7919155 -2.10788344 -0.33277019
H  -3.96088504 -1.72134864 -1.37789208
C  -7.02750433 -2.75426391 -0.35191985
H  -8.32462362 -4.07045963 -1.45919126
H  -5.50513706 -1.50913979 0.52608279
H  -7.70452862 -2.65966655 0.49040445
C  -6.40467395 -0.87391536 -6.18550407
C  -6.42748752 -3.31593145 -6.0658933
C  -7.48789812 -1.42628497 -7.09245993
H  -5.5099981 -0.60371992 -6.74943603
H  -6.70022515 -0.03599809 -5.55767149
C  -6.96426137 -2.8260942 -7.40844454
H  -7.19580409 -3.82102979 -5.48198843
H  -5.55782462 -3.96519566 -6.15245544
H  -8.44756246 -1.47211755 -6.5683544
H  -7.61008082 -0.8025463 -7.97866848
H  -7.73222971 -3.50015046 -7.78898615
H  -6.15792719 -2.77373177 -8.1453223
N  -6.0304197 -2.05163114 -5.29753248
H  -6.61778981 -2.00854972 -4.4584406
