program: Gaussian 16
title: Title Card Required
version: ES64L-G16RevC.02
basis: 6-31+G(d,p)
method: UwB97XD TD-FC
operation: Force
keyword: #p
keyword: td=(nstates=30,root=1)
keyword: uwb97xd/6-31+g(d,p)
keyword: force
keyword: scrf=(CPCM,solvent=chloroform)
keyword: nosymm
keyword: scf=xqc
keyword: Guess=mix
keyword: density=current
title: #p td=(nstates=30,root=1) uwb97xd/6-31+g(d,p) force scrf=(CPCM,solvent
basis: NPDir=0 NMtPBC= 1 NCelOv= 1 NCel= 1 NClECP= 1 NCelD= 1
basis: NCelK= 1 NCelE2= 1 NClLst= 1 CellRange= 0.0.
basis: One-electron integrals computed using PRISM.
basis: NBasis= 859 RedAO= T EigKep= 1.05D-06 NBF= 859
basis: NBsUse= 854 1.00D-06 EigRej= 7.19D-07 NBFU= 854
converged: NO NO NO NO
hfenergy: -1479.207123 hartree
pointgroup: C01 [X(C32H35N3O1)]
dipole: -2.8471913 0.0520295 -3.2676269 debye
InChI: InChI=1/32C.3N.O.35H
charge 2 multiplicity 1
71 atoms
C  0.50899342 -2.63197649 -0.63857276
C  -0.5881229 -2.37098312 -1.54445224
C  -0.80263683 -1.07938263 -1.93887138
C  0.07262238 -0.05384322 -1.46847444
C  1.15135473 -0.32389719 -0.60455784
C  1.39136532 -1.60539113 -0.16622332
C  -0.60010648 -4.58939398 -0.93864879
C  -1.2833218 -3.66639019 -1.75175737
H  -1.61996532 -0.77213927 -2.58007625
H  -0.1073676 0.96460498 -1.79291354
H  1.79270967 0.4864517 -0.28142296
H  2.20952739 -1.84199099 0.50144467
N  0.46560238 -3.92097247 -0.2930316
H  -0.71913949 -5.65435974 -0.84139025
C  1.29012503 -4.49768525 0.77476692
O  2.46159263 -4.23754206 0.77764824
C  0.53250661 -5.26507424 1.81464723
H  -0.1035289 -6.02469498 1.35287162
H  1.27935064 -5.7685422 2.43033275
C  -0.32642464 -4.31716586 2.69580794
H  0.30225064 -3.50786208 3.08315215
H  -0.64249224 -4.91444269 3.55637293
C  -1.54050169 -3.75586755 2.00875977
H  -2.27529852 -4.48356188 1.6633302
C  -1.76489912 -2.45662249 1.81156849
H  -1.05687519 -1.70107423 2.14620919
H  -2.66618041 -2.10839561 1.31753104
C  -2.3747456 -3.9350527 -2.54646843
H  -2.82195498 -4.92356667 -2.53204315
N  -2.94675306 -3.0365447 -3.40409614
H  -2.56304338 -2.10594803 -3.41749386
C  -2.95390791 -0.15460577 -4.9904931
C  -4.13979847 -0.65034468 -4.43808962
C  -4.83339629 0.12987121 -3.5060718
C  -4.34012501 1.37301876 -3.12436166
C  -3.1466166 1.85147322 -3.66403516
C  -2.4553454 1.08816653 -4.60146534
H  -2.41380527 -0.74187487 -5.72773906
H  -5.76152174 -0.22178784 -3.06594224
H  -4.88870167 1.96755501 -2.40185905
H  -2.7628067 2.8200161 -3.3608119
H  -1.53309079 1.45685195 -5.03601825
C  -4.593661 -2.0381635 -4.84414126
H  -4.01753087 -2.34640194 -5.72076997
C  -4.35685885 -3.115307 -3.73748891
H  -4.53385639 -4.09798116 -4.19025904
C  -5.27472561 -2.99010486 -2.52800804
C  -6.49935828 -3.66321965 -2.52275
C  -4.91981226 -2.22721852 -1.41175211
C  -7.37811757 -3.53857096 -1.44723335
H  -6.76059946 -4.32424091 -3.34545584
C  -5.79087917 -2.10806904 -0.33279824
H  -3.95931745 -1.72298282 -1.37857709
C  -7.02680982 -2.75376357 -0.35235087
H  -8.32405254 -4.07032407 -1.45915321
H  -5.50254832 -1.5113433 0.52672212
H  -7.70347535 -2.65926072 0.49018211
C  -6.40406077 -0.8748334 -6.1853827
C  -6.42774587 -3.31683854 -6.06555061
C  -7.48734177 -1.42681253 -7.09211409
H  -5.50919393 -0.60474573 -6.74832204
H  -6.69984486 -0.03671457 -5.55720663
C  -6.96425874 -2.82690635 -7.40811617
H  -7.19631705 -3.82182881 -5.48154642
H  -5.55829742 -3.96618292 -6.15169889
H  -8.44662952 -1.47264444 -6.56759877
H  -7.60974829 -0.80290104 -7.97826748
H  -7.73289241 -3.50049494 -7.78833665
H  -6.157907 -2.77559447 -8.14504813
N  -6.03079052 -2.05239199 -5.29704027
H  -6.6179746 -2.00945213 -4.45833681
