program: Gaussian 16
title: Title Card Required
version: ES64L-G16RevC.02
basis: 6-31+G(d,p)
method: UwB97XD TD-FC
operation: Force
keyword: #p
keyword: td=(nstates=30,root=1)
keyword: uwb97xd/6-31+g(d,p)
keyword: force
keyword: scrf=(CPCM,solvent=chloroform)
keyword: nosymm
keyword: scf=xqc
keyword: Guess=mix
keyword: density=current
title: #p td=(nstates=30,root=1) uwb97xd/6-31+g(d,p) force scrf=(CPCM,solvent
basis: NPDir=0 NMtPBC= 1 NCelOv= 1 NCel= 1 NClECP= 1 NCelD= 1
basis: NCelK= 1 NCelE2= 1 NClLst= 1 CellRange= 0.0.
basis: One-electron integrals computed using PRISM.
basis: NBasis= 859 RedAO= T EigKep= 1.05D-06 NBF= 859
basis: NBsUse= 854 1.00D-06 EigRej= 7.18D-07 NBFU= 854
converged: NO NO NO NO
hfenergy: -1479.207066 hartree
pointgroup: C01 [X(C32H35N3O1)]
dipole: -2.1248288 0.3037542 -2.8235873 debye
InChI: InChI=1/32C.3N.O.35H
charge 2 multiplicity 1
71 atoms
C  0.50921267 -2.63317749 -0.6394922
C  -0.58854772 -2.37299758 -1.5443265
C  -0.8064282 -1.08092687 -1.93765023
C  0.07059765 -0.05653077 -1.47072912
C  1.15034798 -0.32555382 -0.60628613
C  1.39179055 -1.60572762 -0.1677024
C  -0.59917386 -4.59009668 -0.93736597
C  -1.28351209 -3.66932117 -1.75099474
H  -1.62522428 -0.77445764 -2.57577166
H  -0.10864329 0.96194515 -1.79517824
H  1.79152183 0.48601116 -0.28541909
H  2.20962894 -1.83945513 0.50040724
N  0.46578903 -3.92128832 -0.29214955
H  -0.71928612 -5.65509062 -0.83797364
C  1.29187414 -4.49763257 0.77556975
O  2.46293928 -4.23634759 0.77788349
C  0.53461669 -5.26493646 1.81579146
H  -0.10074724 -6.0266006 1.35575931
H  1.2810768 -5.76655311 2.43259512
C  -0.32513204 -4.31614776 2.69469125
H  0.30329386 -3.50723432 3.0822103
H  -0.64227407 -4.91306468 3.55557936
C  -1.53912861 -3.75543409 2.00645489
H  -2.27288856 -4.48329588 1.66086303
C  -1.76428685 -2.45643995 1.81012669
H  -1.05758954 -1.69977557 2.14497494
H  -2.66613136 -2.10885849 1.31587654
C  -2.37584752 -3.9378398 -2.54426868
H  -2.82275346 -4.92563495 -2.52707845
N  -2.94706849 -3.03994597 -3.40427044
H  -2.55590245 -2.11222701 -3.4290264
C  -2.95402908 -0.15374255 -4.99026061
C  -4.13919862 -0.64994065 -4.43711272
C  -4.83257119 0.13047977 -3.50466509
C  -4.33930757 1.37369704 -3.12333534
C  -3.14596614 1.85249464 -3.66363261
C  -2.45537327 1.08920828 -4.60167919
H  -2.41426504 -0.74081642 -5.72814613
H  -5.76028939 -0.2213316 -3.0642354
H  -4.88790991 1.96859712 -2.40076628
H  -2.76252493 2.82119984 -3.36107476
H  -1.53363857 1.45850641 -5.03759521
C  -4.5934445 -2.03779403 -4.84311541
H  -4.01651655 -2.3456453 -5.71914625
C  -4.3575414 -3.11617411 -3.73659773
H  -4.53735333 -4.09791947 -4.19085039
C  -5.2758984 -2.99018042 -2.52748454
C  -6.50000464 -3.66447676 -2.52189108
C  -4.92151183 -2.22603558 -1.41141841
C  -7.37873502 -3.5398152 -1.44649314
H  -6.75966979 -4.32578063 -3.34470006
C  -5.79273141 -2.10677198 -0.33312603
H  -3.96139864 -1.72087398 -1.37838722
C  -7.02836757 -2.75402309 -0.35235151
H  -8.32402022 -4.07209422 -1.45938731
H  -5.50660602 -1.50870006 0.52588137
H  -7.70566077 -2.65994996 0.48982318
C  -6.40425943 -0.87358726 -6.18473657
C  -6.42694806 -3.3157453 -6.06551409
C  -7.48723327 -1.42605529 -7.09182424
H  -5.50944688 -0.60325315 -6.74820182
H  -6.70003719 -0.03579755 -5.55668478
C  -6.96333077 -2.82573077 -7.40809883
H  -7.19516585 -3.82108282 -5.481646
H  -5.5571893 -3.96482575 -6.15219512
H  -8.44665312 -1.47227333 -6.56739651
H  -7.60987968 -0.80214105 -7.97785951
H  -7.73131598 -3.49975326 -7.78858521
H  -6.15695951 -2.77349544 -8.14485479
N  -6.03036644 -2.05144674 -5.29692794
H  -6.61788329 -2.00855433 -4.45816443
