program: Gaussian 16
title: Title Card Required
version: ES64L-G16RevC.02
basis: 6-31+G(d,p)
method: UwB97XD TD-FC
operation: Force
keyword: #p
keyword: td=(nstates=30,root=2)
keyword: uwb97xd/6-31+g(d,p)
keyword: force
keyword: scrf=(CPCM,solvent=chloroform)
keyword: nosymm
keyword: scf=xqc
keyword: Guess=mix
keyword: density=current
title: #p td=(nstates=30,root=2) uwb97xd/6-31+g(d,p) force scrf=(CPCM,solvent
basis: NPDir=0 NMtPBC= 1 NCelOv= 1 NCel= 1 NClECP= 1 NCelD= 1
basis: NCelK= 1 NCelE2= 1 NClLst= 1 CellRange= 0.0.
basis: One-electron integrals computed using PRISM.
basis: NBasis= 859 RedAO= T EigKep= 1.06D-06 NBF= 859
basis: NBsUse= 854 1.00D-06 EigRej= 8.04D-07 NBFU= 854
converged: NO NO NO NO
hfenergy: -1479.1508907 hartree
pointgroup: C01 [X(C32H35N3O1)]
dipole: -5.2082662 -1.2057416 -4.9184158 debye
InChI: InChI=1/32C.3N.O.35H
charge 2 multiplicity 1
71 atoms
C  0.49758453 -2.53196831 -0.712772
C  -0.50690938 -2.39027701 -1.50670181
C  -0.82928515 -1.102222 -1.95577625
C  0.07091823 -0.0374733 -1.45838864
C  1.09660375 -0.25921667 -0.64915293
C  1.40406753 -1.69538683 -0.16193448
C  -0.57429112 -4.60747016 -0.93360319
C  -1.2256366 -3.69860233 -1.70046773
H  -1.65630318 -0.81975431 -2.58088646
H  -0.1529517 0.94575548 -1.78464465
H  1.75895882 0.49204817 -0.28685459
H  2.22679977 -1.8368357 0.48019055
N  0.46741525 -4.05292994 -0.27022243
H  -0.70837041 -5.67132327 -0.8233931
C  1.29538761 -4.50916653 0.75858533
O  2.4777487 -4.23452007 0.78901425
C  0.55122995 -5.26228718 1.81872042
H  -0.08320412 -6.02627542 1.35846038
H  1.29279716 -5.75665911 2.44462337
C  -0.31994486 -4.3101282 2.68442259
H  0.30430416 -3.49779375 3.07215416
H  -0.64374768 -4.90233303 3.54861188
C  -1.53082039 -3.75221142 1.98803177
H  -2.25532313 -4.48215816 1.63171047
C  -1.76598374 -2.45131245 1.80348345
H  -1.06911406 -1.69342512 2.14781468
H  -2.67020989 -2.10876286 1.30921287
C  -2.44706133 -3.92857208 -2.53267372
H  -2.92887226 -4.88563538 -2.39032336
N  -2.95323959 -3.06629835 -3.32653573
H  -2.39073001 -2.28433511 -3.73287487
C  -2.95442365 -0.13624011 -4.99150282
C  -4.13280419 -0.6365333 -4.42818879
C  -4.82658875 0.14142171 -3.49348047
C  -4.33416222 1.38573583 -3.11488774
C  -3.14467175 1.86752955 -3.66128439
C  -2.4575547 1.10821108 -4.60391875
H  -2.42265998 -0.71389235 -5.74237799
H  -5.75177497 -0.21147401 -3.05085747
H  -4.881471 1.97907862 -2.39040284
H  -2.76290333 2.8375573 -3.36033636
H  -1.54091602 1.48092855 -5.04646899
C  -4.58768246 -2.01873052 -4.83736587
H  -4.0114189 -2.33195346 -5.71092482
C  -4.37787017 -3.10370267 -3.73899872
H  -4.53604952 -4.08301867 -4.18507787
C  -5.28555662 -2.98556705 -2.52007463
C  -6.50411369 -3.67470907 -2.52335615
C  -4.9425437 -2.21113776 -1.41335787
C  -7.38614318 -3.55061828 -1.44870095
H  -6.75719233 -4.34022865 -3.34068237
C  -5.81726145 -2.0975469 -0.33641971
H  -3.98910976 -1.69688038 -1.38614717
C  -7.04488151 -2.75780977 -0.35563286
H  -8.32694862 -4.09169913 -1.46003182
H  -5.53895427 -1.49301154 0.52016149
H  -7.72513079 -2.66877165 0.48559523
C  -6.40437079 -0.86597298 -6.17512149
C  -6.41713268 -3.31105233 -6.05664681
C  -7.48392971 -1.42611554 -7.08270691
H  -5.51215945 -0.59084494 -6.73776394
H  -6.70616188 -0.03237704 -5.54589886
C  -6.95140394 -2.8218857 -7.40025256
H  -7.18579651 -3.81555718 -5.47306093
H  -5.5458365 -3.95822501 -6.14127356
H  -8.44420743 -1.47755858 -6.5612536
H  -7.6083433 -0.80197704 -7.96934365
H  -7.71432181 -3.50024481 -7.78277869
H  -6.14340861 -2.76414683 -8.13444209
N  -6.02270369 -2.04599056 -5.28587164
H  -6.61033208 -2.00371947 -4.44803282
