program: Gaussian 16
title: Title Card Required
version: ES64L-G16RevC.02
basis: 6-31+G(d,p)
method: UwB97XD TD-FC
operation: Force
keyword: #p
keyword: td=(nstates=30,root=2)
keyword: uwb97xd/6-31+g(d,p)
keyword: force
keyword: scrf=(CPCM,solvent=chloroform)
keyword: nosymm
keyword: scf=xqc
keyword: Guess=mix
keyword: density=current
title: #p td=(nstates=30,root=2) uwb97xd/6-31+g(d,p) force scrf=(CPCM,solvent
basis: NPDir=0 NMtPBC= 1 NCelOv= 1 NCel= 1 NClECP= 1 NCelD= 1
basis: NCelK= 1 NCelE2= 1 NClLst= 1 CellRange= 0.0.
basis: One-electron integrals computed using PRISM.
basis: NBasis= 859 RedAO= T EigKep= 1.05D-06 NBF= 859
basis: NBsUse= 854 1.00D-06 EigRej= 7.18D-07 NBFU= 854
converged: NO NO NO NO
hfenergy: -1479.2069691 hartree
pointgroup: C01 [X(C32H35N3O1)]
dipole: -1.9698028 0.3467538 -2.7345472 debye
InChI: InChI=1/32C.3N.O.35H
charge 2 multiplicity 1
71 atoms
C  0.51008109 -2.63437658 -0.64046235
C  -0.58965429 -2.37480083 -1.54331193
C  -0.80926563 -1.08272754 -1.93662667
C  0.06869923 -0.05825308 -1.47309327
C  1.14958551 -0.32634293 -0.60906039
C  1.39198394 -1.60584493 -0.16955697
C  -0.59853797 -4.59186034 -0.93596774
C  -1.28462424 -3.67177802 -1.74880853
H  -1.63035757 -0.77676571 -2.57208178
H  -0.11110706 0.96012084 -1.79794022
H  1.78986222 0.48610845 -0.28881966
H  2.20955427 -1.83769045 0.49950174
N  0.46796833 -3.92254368 -0.29280989
H  -0.71982962 -5.65630865 -0.83274256
C  1.29398707 -4.49824318 0.77590547
O  2.46487866 -4.23636702 0.77980339
C  0.53655022 -5.26520193 1.81656942
H  -0.0977571 -6.02865163 1.35870497
H  1.28418474 -5.76408019 2.43443716
C  -0.32395829 -4.31530899 2.6936439
H  0.30456775 -3.50646133 3.0810616
H  -0.64278985 -4.91134718 3.55489209
C  -1.53720822 -3.75483921 2.00426773
H  -2.2700157 -4.4830084 1.65743197
C  -1.76386983 -2.45600306 1.80854976
H  -1.05828652 -1.69805989 2.14307078
H  -2.66635658 -2.10956747 1.31452782
C  -2.37691395 -3.94080369 -2.54168221
H  -2.82473201 -4.92797438 -2.52123617
N  -2.94792605 -3.0443642 -3.40449339
H  -2.54780096 -2.12083147 -3.44375654
C  -2.95382472 -0.152564 -4.98976053
C  -4.13837105 -0.64924119 -4.43582144
C  -4.8317532 0.13094389 -3.50290335
C  -4.33819443 1.37453452 -3.12198372
C  -3.14537328 1.8533147 -3.66320242
C  -2.45535944 1.09025665 -4.60183253
H  -2.41471 -0.73928263 -5.72875874
H  -5.75909525 -0.22060599 -3.06226958
H  -4.88693295 1.96959051 -2.39977004
H  -2.76242503 2.82256645 -3.36156774
H  -1.53453492 1.46050722 -5.03954168
C  -4.59301055 -2.03689388 -4.84178056
H  -4.01555923 -2.34492416 -5.71746394
C  -4.35834979 -3.11635981 -3.73564624
H  -4.54104222 -4.09697794 -4.19071715
C  -5.27660632 -2.99027586 -2.52632704
C  -6.50038265 -3.66625691 -2.52098723
C  -4.9235221 -2.22513547 -1.41090952
C  -7.37951809 -3.5418103 -1.44618723
H  -6.75933419 -4.32763067 -3.34386572
C  -5.79536237 -2.10575421 -0.33328294
H  -3.96406832 -1.71829329 -1.37825816
C  -7.02999084 -2.75475065 -0.35233839
H  -8.32455609 -4.07386731 -1.45947484
H  -5.51120972 -1.50523944 0.52453324
H  -7.70796461 -2.66053564 0.48939034
C  -6.40440631 -0.87233193 -6.18429952
C  -6.42581264 -3.31446062 -6.06548276
C  -7.48732258 -1.42529199 -7.09143652
H  -5.51004226 -0.60140459 -6.74836975
H  -6.70032024 -0.03482339 -5.55604793
C  -6.96237673 -2.82443525 -7.40790204
H  -7.19375251 -3.82004044 -5.4816629
H  -5.55582669 -3.96336757 -6.15254564
H  -8.44696779 -1.47193683 -6.5673829
H  -7.60996976 -0.80143921 -7.97749641
H  -7.7294816 -3.49923289 -7.78895627
H  -6.15592512 -2.77091863 -8.14447538
N  -6.02955195 -2.05020746 -5.29672953
H  -6.61718298 -2.00750827 -4.45774069
