program: Gaussian 16
title: Title Card Required
version: ES64L-G16RevC.02
basis: 6-31+G(d,p)
method: UwB97XD TD-FC
operation: Force
keyword: #p
keyword: td=(nstates=30,root=2)
keyword: uwb97xd/6-31+g(d,p)
keyword: force
keyword: scrf=(CPCM,solvent=chloroform)
keyword: nosymm
keyword: scf=xqc
keyword: Guess=mix
keyword: density=current
title: #p td=(nstates=30,root=2) uwb97xd/6-31+g(d,p) force scrf=(CPCM,solvent
basis: NPDir=0 NMtPBC= 1 NCelOv= 1 NCel= 1 NClECP= 1 NCelD= 1
basis: NCelK= 1 NCelE2= 1 NClLst= 1 CellRange= 0.0.
basis: One-electron integrals computed using PRISM.
basis: NBasis= 859 RedAO= T EigKep= 1.05D-06 NBF= 859
basis: NBsUse= 854 1.00D-06 EigRej= 7.17D-07 NBFU= 854
converged: NO NO NO NO
hfenergy: -1479.2069264 hartree
pointgroup: C01 [X(C32H35N3O1)]
dipole: -1.8803363 0.3628856 -2.678227 debye
InChI: InChI=1/32C.3N.O.35H
charge 2 multiplicity 1
71 atoms
C  0.51032955 -2.63461098 -0.64065962
C  -0.59013414 -2.3749613 -1.54289731
C  -0.80985836 -1.08312052 -1.93630002
C  0.06847958 -0.05836826 -1.47357261
C  1.14955681 -0.32647503 -0.61004944
C  1.39195034 -1.60588114 -0.16994165
C  -0.59854328 -4.59246816 -0.93581887
C  -1.28498348 -3.67202691 -1.74833382
H  -1.63175849 -0.77659857 -2.57094873
H  -0.11132801 0.95978555 -1.79865524
H  1.78964434 0.48609349 -0.28977379
H  2.20935293 -1.83704539 0.49980226
N  0.46870702 -3.9229889 -0.29321017
H  -0.71991454 -5.65676107 -0.8318186
C  1.29433795 -4.49843452 0.77584441
O  2.46524298 -4.23640984 0.78064841
C  0.5369295 -5.26540511 1.81689047
H  -0.09727313 -6.02924812 1.35964316
H  1.28486169 -5.76338576 2.43492826
C  -0.32363944 -4.31510342 2.69359312
H  0.30480538 -3.50640129 3.08080598
H  -0.64297126 -4.91108172 3.55491563
C  -1.53683344 -3.75472547 2.00403119
H  -2.26949503 -4.48304439 1.6568463
C  -1.76373823 -2.45587473 1.80833813
H  -1.05843482 -1.69771582 2.14267383
H  -2.66628083 -2.10973534 1.31428832
C  -2.37674891 -3.94152379 -2.5417552
H  -2.82421083 -4.92899229 -2.5210725
N  -2.94815663 -3.04553918 -3.40490955
H  -2.5472313 -2.12169114 -3.44546336
C  -2.95376396 -0.1523704 -4.98968328
C  -4.13826037 -0.64899636 -4.43560952
C  -4.83172453 0.13094191 -3.50262323
C  -4.33800635 1.37473244 -3.12161802
C  -3.14502044 1.85320037 -3.6631894
C  -2.45550951 1.0903562 -4.60163542
H  -2.41476659 -0.73911192 -5.72882464
H  -5.75891042 -0.22048253 -3.0618692
H  -4.88684444 1.96980207 -2.39978771
H  -2.76237428 2.82267457 -3.3616292
H  -1.53463605 1.46084168 -5.04007469
C  -4.59297909 -2.03656552 -4.84143893
H  -4.01536908 -2.34487784 -5.71704868
C  -4.35874565 -3.11626791 -3.73547041
H  -4.54193713 -4.09659305 -4.19059318
C  -5.27661529 -2.9902833 -2.52606023
C  -6.50019686 -3.66651008 -2.52093079
C  -4.92381546 -2.22496802 -1.41069952
C  -7.37971859 -3.54226489 -1.44616503
H  -6.75924604 -4.32798352 -3.34375272
C  -5.7959078 -2.10565181 -0.33320148
H  -3.96441539 -1.71785786 -1.37808061
C  -7.03013396 -2.75499709 -0.35223143
H  -8.32478065 -4.07402324 -1.45957577
H  -5.5119971 -1.50436408 0.52426791
H  -7.70817185 -2.66063353 0.48926971
C  -6.40444033 -0.87204743 -6.1842672
C  -6.42563806 -3.31420134 -6.06557118
C  -7.48740593 -1.42513063 -7.09140175
H  -5.51018673 -0.60101263 -6.74853329
H  -6.70030128 -0.03474147 -5.55594858
C  -6.96228158 -2.82418877 -7.4079216
H  -7.19352427 -3.81977126 -5.48174896
H  -5.55563557 -3.9632115 -6.15276806
H  -8.44707525 -1.47181237 -6.567453
H  -7.60997439 -0.8012839 -7.97750169
H  -7.72920609 -3.4991627 -7.78909598
H  -6.15583106 -2.7703849 -8.14446957
N  -6.0293809 -2.05001219 -5.29676349
H  -6.61701456 -2.00730729 -4.45770706
