program: Gaussian 16
title: Title Card Required
version: ES64L-G16RevC.02
basis: 6-31+G(d,p)
method: UwB97XD TD-FC
operation: Force
keyword: #p
keyword: td=(nstates=30,root=1)
keyword: uwb97xd/6-31+g(d,p)
keyword: force
keyword: scrf=(CPCM,solvent=chloroform)
keyword: nosymm
keyword: scf=xqc
keyword: Guess=mix
keyword: density=current
title: #p td=(nstates=30,root=1) uwb97xd/6-31+g(d,p) force scrf=(CPCM,solvent
basis: NPDir=0 NMtPBC= 1 NCelOv= 1 NCel= 1 NClECP= 1 NCelD= 1
basis: NCelK= 1 NCelE2= 1 NClLst= 1 CellRange= 0.0.
basis: One-electron integrals computed using PRISM.
basis: NBasis= 859 RedAO= T EigKep= 1.06D-06 NBF= 859
basis: NBsUse= 854 1.00D-06 EigRej= 7.22D-07 NBFU= 854
converged: NO NO NO NO
hfenergy: -1479.206478 hartree
pointgroup: C01 [X(C32H35N3O1)]
dipole: -3.9077612 -0.5535406 -3.9429555 debye
InChI: InChI=1/32C.3N.O.35H
charge 2 multiplicity 1
71 atoms
C  0.51017596 -2.63782629 -0.63782635
C  -0.58999836 -2.38217831 -1.54126539
C  -0.81269031 -1.09324271 -1.9394642
C  0.05990999 -0.06491719 -1.47289609
C  1.14261497 -0.32940267 -0.60801285
C  1.39327191 -1.60693306 -0.17146902
C  -0.59970946 -4.59682147 -0.924897
C  -1.28557318 -3.67959902 -1.74072551
H  -1.63255241 -0.7930805 -2.58042901
H  -0.1207991 0.95254979 -1.79905066
H  1.77999023 0.48595866 -0.29069261
H  2.22094366 -1.8371498 0.48651765
N  0.47040093 -3.9238294 -0.28791303
H  -0.72090957 -5.6603922 -0.81081726
C  1.30283899 -4.49732468 0.77584738
O  2.47355004 -4.23407306 0.77218156
C  0.54557134 -5.26339426 1.8161854
H  -0.08780277 -6.0232195 1.35171865
H  1.28761868 -5.7655751 2.4376225
C  -0.32034299 -4.31218621 2.68738344
H  0.30594815 -3.50243679 3.07663689
H  -0.64286006 -4.90877629 3.54677954
C  -1.53329702 -3.75235557 1.99560332
H  -2.2635769 -4.48166113 1.64596175
C  -1.76440823 -2.45389594 1.80310564
H  -1.06170383 -1.69339903 2.13764179
H  -2.66890823 -2.1096033 1.3107096
C  -2.38439932 -3.94422902 -2.52591561
H  -2.84967328 -4.92276057 -2.4814304
N  -2.9495557 -3.05119237 -3.39539973
H  -2.50518441 -2.15554948 -3.5152684
C  -2.9530963 -0.14852524 -4.98955071
C  -4.13570585 -0.64600935 -4.43317224
C  -4.8283829 0.13250741 -3.49884027
C  -4.33520949 1.37685896 -3.11822606
C  -3.14567052 1.85783904 -3.66391585
C  -2.45578848 1.09607808 -4.60272366
H  -2.41485332 -0.73299284 -5.73087975
H  -5.75441877 -0.21993579 -3.05692164
H  -4.88201629 1.96904222 -2.39251167
H  -2.76544651 2.82957 -3.36558452
H  -1.53634195 1.46725701 -5.04225265
C  -4.59124476 -2.03327799 -4.83834257
H  -4.01604868 -2.34127585 -5.71558576
C  -4.35840435 -3.11445585 -3.73270506
H  -4.54241183 -4.09364592 -4.18999677
C  -5.28185067 -2.98980042 -2.52621585
C  -6.50339507 -3.67072673 -2.52019796
C  -4.93270635 -2.22115387 -1.4122064
C  -7.38347184 -3.54678799 -1.44541795
H  -6.76200916 -4.33551377 -3.34032789
C  -5.80533332 -2.10217392 -0.33535931
H  -3.97449724 -1.71198423 -1.38292072
C  -7.03817321 -2.75490776 -0.3538893
H  -8.32540914 -4.0847804 -1.45529204
H  -5.52220206 -1.50094999 0.52237637
H  -7.71694599 -2.66019277 0.48711798
C  -6.40446414 -0.86895511 -6.18159449
C  -6.42188503 -3.3109639 -6.06311617
C  -7.4863653 -1.42386299 -7.08918147
H  -5.51029212 -0.59745722 -6.74556228
H  -6.70206564 -0.03108766 -5.55465428
C  -6.95813323 -2.82160706 -7.4058461
H  -7.18874217 -3.81941335 -5.4802242
H  -5.54997478 -3.9570698 -6.1500559
H  -8.44603979 -1.47325583 -6.56543879
H  -7.61056212 -0.80000706 -7.97513442
H  -7.72301505 -3.49788359 -7.78862564
H  -6.15047628 -2.76574188 -8.14096343
N  -6.02853366 -2.04634962 -5.29319344
H  -6.61638533 -2.00417156 -4.45462707
