program: Gaussian 16
title: Title Card Required
version: ES64L-G16RevC.02
basis: 6-31+G(d,p)
method: UwB97XD TD-FC
operation: Force
keyword: #p
keyword: td=(nstates=30,root=1)
keyword: uwb97xd/6-31+g(d,p)
keyword: force
keyword: scrf=(CPCM,solvent=chloroform)
keyword: nosymm
keyword: scf=xqc
keyword: Guess=mix
keyword: density=current
title: #p td=(nstates=30,root=1) uwb97xd/6-31+g(d,p) force scrf=(CPCM,solvent
basis: NPDir=0 NMtPBC= 1 NCelOv= 1 NCel= 1 NClECP= 1 NCelD= 1
basis: NCelK= 1 NCelE2= 1 NClLst= 1 CellRange= 0.0.
basis: One-electron integrals computed using PRISM.
basis: NBasis= 859 RedAO= T EigKep= 1.07D-06 NBF= 859
basis: NBsUse= 854 1.00D-06 EigRej= 7.26D-07 NBFU= 854
converged: NO NO NO NO
hfenergy: -1479.2064626 hartree
pointgroup: C01[X(C32H35N3O1)]
dipole: -3.8461045 -0.5453427 -3.9031983 debye
InChI: InChI=1/32C.3N.O.35H
charge 2 multiplicity 1
71 atoms
C  0.51499913 -2.63902766 -0.64171644
C  -0.58797477 -2.38294971 -1.54427506
C  -0.81001714 -1.09438425 -1.94419756
C  0.05813834 -0.06575758 -1.47345407
C  1.14175069 -0.32869432 -0.60790758
C  1.39555552 -1.60721396 -0.17531537
C  -0.60076006 -4.59660158 -0.92399639
C  -1.28841865 -3.67959765 -1.73717588
H  -1.6275481 -0.79805565 -2.58710988
H  -0.12819415 0.95339867 -1.79321003
H  1.77458893 0.48778446 -0.28522702
H  2.22280199 -1.83677433 0.48298255
N  0.47288626 -3.92468007 -0.29171538
H  -0.72355824 -5.65942318 -0.80964799
C  1.30493008 -4.4981951 0.77405941
O  2.47587944 -4.23815923 0.77115764
C  0.54579344 -5.26183904 1.81448619
H  -0.08799511 -6.0222889 1.35020224
H  1.28841654 -5.76399268 2.43584507
C  -0.3202071 -4.3113817 2.68636633
H  0.30496914 -3.50105403 3.07528134
H  -0.64174339 -4.90845863 3.54552813
C  -1.53343177 -3.75259076 1.99425248
H  -2.26291209 -4.48199603 1.64355258
C  -1.7649694 -2.45395531 1.80216826
H  -1.06281419 -1.69386869 2.13905706
H  -2.66839043 -2.10966899 1.30810295
C  -2.3929076 -3.94158176 -2.51554095
H  -2.86916573 -4.91350641 -2.45854049
N  -2.95259612 -3.0545045 -3.39381265
H  -2.49586913 -2.16834053 -3.53831373
C  -2.952303 -0.14676666 -4.98915158
C  -4.13445297 -0.64562222 -4.43192418
C  -4.82669992 0.13291811 -3.49705195
C  -4.33489034 1.37709327 -3.11735699
C  -3.145588 1.85966862 -3.66372775
C  -2.45619559 1.09763143 -4.60309327
H  -2.41461745 -0.7306768 -5.73156525
H  -5.75236129 -0.22047704 -3.05458992
H  -4.88183297 1.9697455 -2.39196227
H  -2.76602474 2.83118646 -3.3655843
H  -1.53758765 1.47034051 -5.04382951
C  -4.5898511 -2.03255895 -4.83767655
H  -4.01457177 -2.34036986 -5.71484207
C  -4.36058599 -3.11383042 -3.7331109
H  -4.549051 -4.0918603 -4.19192994
C  -5.28259308 -2.98953068 -2.52713903
C  -6.50269071 -3.67203869 -2.52069388
C  -4.93371499 -2.22024451 -1.41308946
C  -7.38362846 -3.54838224 -1.44645646
H  -6.7590832 -4.33831361 -3.34065466
C  -5.80685858 -2.10151767 -0.33692847
H  -3.97536607 -1.71110502 -1.3843369
C  -7.03915468 -2.75526959 -0.35553292
H  -8.32496699 -4.08716492 -1.45659608
H  -5.52466356 -1.49934318 0.52034597
H  -7.71806729 -2.66083049 0.48515387
C  -6.40322198 -0.86906071 -6.17949092
C  -6.42006987 -3.31131332 -6.06156143
C  -7.4846218 -1.42413157 -7.08716287
H  -5.50897577 -0.59640185 -6.74281962
H  -6.70110071 -0.03203763 -5.5513321
C  -6.95605284 -2.8217661 -7.40422599
H  -7.18710171 -3.81915267 -5.47843223
H  -5.54858023 -3.95784657 -6.14824723
H  -8.44402896 -1.47420743 -6.56288758
H  -7.60921901 -0.80008107 -7.97274548
H  -7.72076632 -3.49825685 -7.78696671
H  -6.1482479 -2.76590193 -8.13908054
N  -6.02681044 -2.04640231 -5.29194756
H  -6.61411637 -2.00502301 -4.45299902
