program: Gaussian 16
title: Title Card Required
version: ES64L-G16RevC.02
basis: 6-31+G(d,p)
method: UwB97XD TD-FC
operation: Force
keyword: #p
keyword: td=(nstates=30,root=1)
keyword: uwb97xd/6-31+g(d,p)
keyword: force
keyword: scrf=(CPCM,solvent=chloroform)
keyword: nosymm
keyword: scf=xqc
keyword: Guess=mix
keyword: density=current
title: #p td=(nstates=30,root=1) uwb97xd/6-31+g(d,p) force scrf=(CPCM,solvent
basis: NPDir=0 NMtPBC= 1 NCelOv= 1 NCel= 1 NClECP= 1 NCelD= 1
basis: NCelK= 1 NCelE2= 1 NClLst= 1 CellRange= 0.0.
basis: One-electron integrals computed using PRISM.
basis: NBasis= 859 RedAO= T EigKep= 1.07D-06 NBF= 859
basis: NBsUse= 854 1.00D-06 EigRej= 7.25D-07 NBFU= 854
converged: NO NO NO NO
hfenergy: -1479.2063596 hartree
pointgroup: C01 [X(C32H35N3O1)]
dipole: -3.6071043 -0.4835105 -3.7600231 debye
InChI: InChI=1/32C.3N.O.35H
charge 2 multiplicity 1
71 atoms
C  0.51578153 -2.64071301 -0.64398688
C  -0.58713885 -2.38440823 -1.54462296
C  -0.80780005 -1.09626299 -1.94496639
C  0.05777117 -0.06522764 -1.47275577
C  1.14022192 -0.32811129 -0.60825042
C  1.39646504 -1.60661226 -0.17773591
C  -0.60106647 -4.59833835 -0.92364007
C  -1.29034772 -3.67947861 -1.73467838
H  -1.6247052 -0.80074537 -2.59023939
H  -0.13066075 0.9544322 -1.79034865
H  1.77225055 0.4898122 -0.2833535
H  2.22279567 -1.835626 0.48051821
N  0.47503944 -3.9264083 -0.29229893
H  -0.72532109 -5.6618567 -0.80827956
C  1.3061737 -4.49847243 0.77341962
O  2.47785207 -4.24018752 0.77146724
C  0.54598635 -5.26096544 1.81379273
H  -0.08755379 -6.02124657 1.3486243
H  1.28828896 -5.76306384 2.43475306
C  -0.31998386 -4.31059788 2.68498001
H  0.30420888 -3.49982771 3.07522353
H  -0.64073161 -4.90862389 3.54445473
C  -1.53334121 -3.75239623 1.99351125
H  -2.26287355 -4.48224783 1.64270642
C  -1.76481504 -2.45384897 1.80165271
H  -1.06354207 -1.69420836 2.14007266
H  -2.66824766 -2.10981377 1.30677566
C  -2.39733011 -3.93723413 -2.50930259
H  -2.87706432 -4.90849041 -2.45045919
N  -2.95333121 -3.05487926 -3.39243992
H  -2.490227 -2.174886 -3.5500396
C  -2.95240519 -0.14670848 -4.98908951
C  -4.13357089 -0.64534264 -4.43115663
C  -4.82607967 0.13235293 -3.49653734
C  -4.33431221 1.37804131 -3.11704147
C  -3.14609677 1.86006994 -3.66395229
C  -2.45618311 1.09922408 -4.60325157
H  -2.41442415 -0.72954626 -5.73181234
H  -5.75132157 -0.2207407 -3.05358669
H  -4.88154634 1.96984629 -2.39156143
H  -2.76619827 2.83210257 -3.36548205
H  -1.53824039 1.4716095 -5.04425595
C  -4.58958783 -2.03206249 -4.8371942
H  -4.014174 -2.33980504 -5.71491308
C  -4.36128313 -3.11463662 -3.73405409
H  -4.55437986 -4.09103461 -4.19345419
C  -5.28309675 -2.98903976 -2.52710619
C  -6.50287721 -3.67257591 -2.52098614
C  -4.93397371 -2.2198127 -1.41416902
C  -7.3836548 -3.54881055 -1.44699047
H  -6.75740313 -4.33955857 -3.34063722
C  -5.80793387 -2.10117256 -0.33752588
H  -3.97587227 -1.71092205 -1.3850916
C  -7.03968655 -2.75540552 -0.3564196
H  -8.32490298 -4.08860957 -1.45687206
H  -5.52571699 -1.49886607 0.51950233
H  -7.71878007 -2.66104137 0.48450564
C  -6.40261075 -0.86889885 -6.17829136
C  -6.41946049 -3.31130027 -6.06081604
C  -7.48385337 -1.42436535 -7.08618815
H  -5.50830448 -0.59589482 -6.74154235
H  -6.70058896 -0.0325844 -5.54990543
C  -6.95506183 -2.82188988 -7.40339406
H  -7.18636824 -3.81913159 -5.47761263
H  -5.54775231 -3.9581577 -6.14736375
H  -8.44299666 -1.47464025 -6.56172237
H  -7.60868489 -0.8000663 -7.9716449
H  -7.71967354 -3.49843879 -7.78621892
H  -6.14714675 -2.76605781 -8.13829231
N  -6.02604156 -2.04649351 -5.29160411
H  -6.61358717 -2.00536206 -4.45216253
