program: Gaussian 16
title: Title Card Required
version: ES64L-G16RevC.02
basis: 6-31+G(d,p)
method: UwB97XD TD-FC
operation: Force
keyword: #p
keyword: td=(nstates=30,root=2)
keyword: uwb97xd/6-31+g(d,p)
keyword: force
keyword: scrf=(CPCM,solvent=chloroform)
keyword: nosymm
keyword: scf=xqc
keyword: Guess=mix
keyword: density=current
title: #p td=(nstates=30,root=2) uwb97xd/6-31+g(d,p) force scrf=(CPCM,solvent
basis: NPDir=0 NMtPBC= 1 NCelOv= 1 NCel= 1 NClECP= 1 NCelD= 1
basis: NCelK= 1 NCelE2= 1 NClLst= 1 CellRange= 0.0.
basis: One-electron integrals computed using PRISM.
basis: NBasis= 859 RedAO= T EigKep= 1.07D-06 NBF= 859
basis: NBsUse= 854 1.00D-06 EigRej= 7.24D-07 NBFU= 854
converged: NO NO NO NO
hfenergy: -1479.2062587 hartree
pointgroup: C01 [X(C32H35N3O1)]
dipole: -1.9156558 0.379399 -2.771799 debye
InChI: InChI=1/32C.3N.O.35H
charge 2 multiplicity 1
71 atoms
C  0.51724098 -2.64172864 -0.64642066
C  -0.58587857 -2.38526959 -1.54681515
C  -0.80670183 -1.09746925 -1.94686034
C  0.05771298 -0.0639851 -1.47232384
C  1.14003133 -0.32660271 -0.6081675
C  1.39672102 -1.60672324 -0.18050769
C  -0.60105898 -4.59928221 -0.9240945
C  -1.2905117 -3.67834867 -1.7339637
H  -1.62351667 -0.80186867 -2.59231439
H  -0.13311629 0.95511169 -1.78782422
H  1.76996704 0.49078501 -0.28148771
H  2.22269753 -1.83541612 0.47941405
N  0.47620753 -3.92657008 -0.29334171
H  -0.72670369 -5.66239801 -0.80824522
C  1.3060425 -4.49887051 0.77255349
O  2.47835986 -4.24224243 0.77139524
C  0.54549191 -5.26083066 1.81273977
H  -0.08744992 -6.02143462 1.34904587
H  1.28846349 -5.76208998 2.43385159
C  -0.32003934 -4.31044115 2.6850626
H  0.30398899 -3.49940918 3.07495207
H  -0.64017233 -4.90797859 3.54397182
C  -1.5335707 -3.75271871 1.99272056
H  -2.26244137 -4.48234282 1.64182012
C  -1.76501168 -2.45402563 1.80117316
H  -1.06378431 -1.6943206 2.14090363
H  -2.6679119 -2.11010555 1.30603602
C  -2.40101907 -3.9352494 -2.50436473
H  -2.88450936 -4.90408276 -2.44126819
N  -2.95371429 -3.05670975 -3.39200541
H  -2.48546768 -2.18056644 -3.55832123
C  -2.95187874 -0.145466 -4.98887603
C  -4.13310314 -0.64562795 -4.43036374
C  -4.82519601 0.13330514 -3.49562106
C  -4.33454075 1.37756121 -3.11701103
C  -3.14579099 1.86128249 -3.66371195
C  -2.4566311 1.09939466 -4.60364346
H  -2.41451423 -0.72849252 -5.73226899
H  -5.7506886 -0.22079004 -3.05276952
H  -4.88155416 1.97043671 -2.39141066
H  -2.76626587 2.83260248 -3.36526183
H  -1.53867021 1.47293187 -5.04484552
C  -4.58877128 -2.03217888 -4.83703472
H  -4.01339209 -2.33936524 -5.71440057
C  -4.36211667 -3.11499992 -3.73425511
H  -4.55787303 -4.09150364 -4.19477257
C  -5.28303461 -2.98933752 -2.52769878
C  -6.50225383 -3.67293183 -2.52149412
C  -4.9349687 -2.21936629 -1.41381083
C  -7.38444613 -3.54984663 -1.44747791
H  -6.75605358 -4.340295 -3.34067113
C  -5.80810331 -2.10113446 -0.33884775
H  -3.97597792 -1.71026526 -1.38556341
C  -7.03985847 -2.75544535 -0.35644949
H  -8.32451829 -4.0891692 -1.45755606
H  -5.52677573 -1.49789376 0.51903921
H  -7.71927414 -2.66147625 0.48378752
C  -6.40203036 -0.86913711 -6.17760861
C  -6.41856287 -3.31158255 -6.06020486
C  -7.48315552 -1.42445801 -7.08539904
H  -5.5079353 -0.59536538 -6.74059481
H  -6.70033001 -0.03293745 -5.54851261
C  -6.95428035 -2.82197232 -7.40280717
H  -7.18584012 -3.81890169 -5.47682621
H  -5.54737486 -3.95851796 -6.14661136
H  -8.44235805 -1.47498125 -6.56082897
H  -7.60817696 -0.80018413 -7.97070666
H  -7.71880453 -3.49861889 -7.78554712
H  -6.14638257 -2.76610132 -8.13759392
N  -6.02545934 -2.04649239 -5.29071894
H  -6.61248209 -2.00575501 -4.45170201
