program: Gaussian 16
title: Title Card Required
version: ES64L-G16RevC.02
basis: 6-31+G(d,p)
method: UwB97XD TD-FC
operation: Force
keyword: #p
keyword: td=(nstates=30,root=1)
keyword: uwb97xd/6-31+g(d,p)
keyword: force
keyword: scrf=(CPCM,solvent=chloroform)
keyword: nosymm
keyword: scf=xqc
keyword: Guess=mix
keyword: density=current
title: #p td=(nstates=30,root=1) uwb97xd/6-31+g(d,p) force scrf=(CPCM,solvent
basis: NPDir=0 NMtPBC= 1 NCelOv= 1 NCel= 1 NClECP= 1 NCelD= 1
basis: NCelK= 1 NCelE2= 1 NClLst= 1 CellRange= 0.0.
basis: One-electron integrals computed using PRISM.
basis: NBasis= 859 RedAO= T EigKep= 1.07D-06 NBF= 859
basis: NBsUse= 854 1.00D-06 EigRej= 7.30D-07 NBFU= 854
converged: NO NO NO NO
hfenergy: -1479.2065203 hartree
pointgroup: C01 [X(C32H35N3O1)]
dipole: -3.9014368 -0.5372216 -3.9387187 debye
InChI: InChI=1/32C.3N.O.35H
charge 2 multiplicity 1
71 atoms
C  0.52124511 -2.64111971 -0.6526919
C  -0.58238861 -2.38429417 -1.55497634
C  -0.8055198 -1.09602532 -1.95254069
C  0.05667692 -0.06397293 -1.47326552
C  1.13970534 -0.32667671 -0.60854077
C  1.39968278 -1.60662606 -0.18325246
C  -0.60056916 -4.59612991 -0.92631669
C  -1.28986903 -3.67751238 -1.73689861
H  -1.62450701 -0.80157518 -2.59530694
H  -0.13915955 0.95646142 -1.7836203
H  1.76701331 0.49198065 -0.27606762
H  2.22245191 -1.83708703 0.47896567
N  0.47637773 -3.92524683 -0.29697713
H  -0.72822131 -5.65843426 -0.8107495
C  1.30405351 -4.49973126 0.770354
O  2.47667901 -4.24596042 0.76993423
C  0.54407892 -5.26097278 1.81255108
H  -0.08922696 -6.02510315 1.35282899
H  1.28962651 -5.76019017 2.43224942
C  -0.32037728 -4.31068951 2.68483562
H  0.30472526 -3.50009985 3.07352388
H  -0.64084082 -4.90651176 3.54599229
C  -1.53326352 -3.75321973 1.99241614
H  -2.26154687 -4.48311893 1.63918223
C  -1.76493115 -2.45442841 1.80110785
H  -1.06424435 -1.69506165 2.14154078
H  -2.66752385 -2.11048794 1.30505932
C  -2.40596328 -3.93533883 -2.49810653
H  -2.90040803 -4.89788104 -2.41745365
N  -2.95472661 -3.06243001 -3.39276727
H  -2.47899329 -2.19219397 -3.56989147
C  -2.95189429 -0.14435074 -4.98859034
C  -4.13185691 -0.64523782 -4.42891923
C  -4.82439007 0.13325142 -3.4945121
C  -4.33391601 1.37886614 -3.1160929
C  -3.1453403 1.8620841 -3.6629387
C  -2.45660904 1.10113612 -4.60347931
H  -2.41519432 -0.72616 -5.73338082
H  -5.74966218 -0.22017827 -3.0513656
H  -4.8819914 1.97195979 -2.39208025
H  -2.76597446 2.83377373 -3.36449643
H  -1.53984271 1.47539034 -5.04638742
C  -4.58718027 -2.03209907 -4.83582019
H  -4.01055359 -2.3392269 -5.71289981
C  -4.36233137 -3.11638464 -3.73458762
H  -4.55933231 -4.0919928 -4.19537662
C  -5.28254729 -2.98980189 -2.52739534
C  -6.50145783 -3.67403244 -2.5211785
C  -4.93438643 -2.2188367 -1.41468118
C  -7.38302134 -3.5507132 -1.44828201
H  -6.75426862 -4.34140097 -3.34140479
C  -5.80918407 -2.10056371 -0.33864791
H  -3.97706652 -1.70860663 -1.38588695
C  -7.04010342 -2.75680923 -0.35758641
H  -8.32483898 -4.08973317 -1.45984163
H  -5.52915118 -1.4956969 0.51736219
H  -7.71989084 -2.6625897 0.48255562
C  -6.4012563 -0.86917056 -6.17592388
C  -6.41741385 -3.31173318 -6.05911048
C  -7.48224784 -1.42488358 -7.08390902
H  -5.50752036 -0.5943852 -6.73915908
H  -6.699997 -0.03395831 -5.54628671
C  -6.9530206 -2.82217939 -7.40151178
H  -7.18490843 -3.81810833 -5.47540119
H  -5.54668839 -3.95983321 -6.14536678
H  -8.44143257 -1.47554649 -6.55951681
H  -7.60708701 -0.80048885 -7.96922962
H  -7.71742068 -3.49898179 -7.78430088
H  -6.14517377 -2.76592993 -8.13641636
N  -6.02327294 -2.04690096 -5.29027827
H  -6.60968938 -2.0065302 -4.45013093
