program: Gaussian 16
title: Title Card Required
version: ES64L-G16RevC.02
basis: 6-31+G(d,p)
method: UwB97XD TD-FC
operation: Force
keyword: #p
keyword: td=(nstates=30,root=1)
keyword: uwb97xd/6-31+g(d,p)
keyword: force
keyword: scrf=(CPCM,solvent=chloroform)
keyword: nosymm
keyword: scf=xqc
keyword: Guess=mix
keyword: density=current
title: #p td=(nstates=30,root=1) uwb97xd/6-31+g(d,p) force scrf=(CPCM,solvent
basis: NPDir=0 NMtPBC= 1 NCelOv= 1 NCel= 1 NClECP= 1 NCelD= 1
basis: NCelK= 1 NCelE2= 1 NClLst= 1 CellRange= 0.0.
basis: One-electron integrals computed using PRISM.
basis: NBasis= 859 RedAO= T EigKep= 1.08D-06 NBF= 859
basis: NBsUse= 854 1.00D-06 EigRej= 7.34D-07 NBFU= 854
converged: NO NO NO NO
hfenergy: -1479.2068524 hartree
pointgroup: C01[X(C32H35N3O1)]
dipole: -3.8664169 -0.5258821 -3.9065853 debye
InChI: InChI=1/32C.3N.O.35H
charge 2 multiplicity 1
71 atoms
C  0.52432956 -2.64101885 -0.66215176
C  -0.5761887 -2.38492627 -1.56747036
C  -0.80393135 -1.09380809 -1.95970014
C  0.05528957 -0.06271809 -1.474336
C  1.13887079 -0.3262551 -0.60856515
C  1.40035027 -1.60671156 -0.18755304
C  -0.60071352 -4.59291849 -0.9301217
C  -1.28611274 -3.67610425 -1.74408166
H  -1.62759764 -0.79755956 -2.59717665
H  -0.14401021 0.9591783 -1.77786112
H  1.76211899 0.49194477 -0.27098107
H  2.22160357 -1.83835746 0.47791465
N  0.47530151 -3.92295773 -0.29930701
H  -0.72915182 -5.65499807 -0.81367996
C  1.29910977 -4.50067208 0.76762656
O  2.47239441 -4.24924418 0.76578633
C  0.54151569 -5.26324305 1.81263051
H  -0.09157824 -6.03059704 1.35922889
H  1.29082814 -5.75790918 2.43105277
C  -0.32093834 -4.31167059 2.68550627
H  0.30646157 -3.50126702 3.07129381
H  -0.6418631 -4.90432992 3.54826152
C  -1.53319284 -3.75368095 1.99160109
H  -2.25957045 -4.48396927 1.63591456
C  -1.76496418 -2.45532653 1.80101313
H  -1.06439839 -1.69575156 2.14209041
H  -2.66709405 -2.11104122 1.30445832
C  -2.40987371 -3.93706429 -2.49144778
H  -2.91685913 -4.88981189 -2.38350094
N  -2.9545432 -3.06885148 -3.39341484
H  -2.46971896 -2.20730137 -3.58200884
C  -2.95149296 -0.14247902 -4.98824731
C  -4.13053089 -0.64521485 -4.42666389
C  -4.8229912 0.1341658 -3.49287373
C  -4.33368213 1.37972587 -3.11529322
C  -3.14445159 1.86353846 -3.66201236
C  -2.4568894 1.10293376 -4.60336205
H  -2.41648131 -0.72291364 -5.73511831
H  -5.74898818 -0.2189259 -3.04987741
H  -4.88258987 1.97421148 -2.39294784
H  -2.7653385 2.83500835 -3.36332851
H  -1.54118323 1.47834696 -5.04818638
C  -4.58459589 -2.03250904 -4.83450161
H  -4.00670943 -2.33904889 -5.71069317
C  -4.36143984 -3.11833888 -3.73410338
H  -4.55943168 -4.09356553 -4.1956773
C  -5.28104069 -2.99079347 -2.52650923
C  -6.49980546 -3.67600727 -2.52209369
C  -4.93481628 -2.21882681 -1.41509723
C  -7.38282677 -3.55176704 -1.44841032
H  -6.75297479 -4.34199541 -3.34180192
C  -5.8100416 -2.09998063 -0.33928351
H  -3.97837256 -1.70549222 -1.38607498
C  -7.04032044 -2.75834523 -0.35902
H  -8.32456456 -4.08976436 -1.46258435
H  -5.532273 -1.49300717 0.5154633
H  -7.72069092 -2.66428802 0.48151948
C  -6.40037827 -0.86943606 -6.17421793
C  -6.41590261 -3.3120289 -6.05783193
C  -7.48129141 -1.42531944 -7.08226881
H  -5.50738214 -0.59306604 -6.73773123
H  -6.70008746 -0.03488189 -5.54389903
C  -6.95168696 -2.82236774 -7.40012583
H  -7.18408502 -3.81703283 -5.47379338
H  -5.54622123 -3.96126764 -6.14413498
H  -8.44081492 -1.47625114 -6.5583292
H  -7.60592611 -0.8010228 -7.96764161
H  -7.71589099 -3.49940213 -7.78290672
H  -6.1439655 -2.76554375 -8.13501271
N  -6.02082795 -2.04716355 -5.28916181
H  -6.6059685 -2.00720229 -4.44852468
