program: Gaussian 16
title: Title Card Required
version: ES64L-G16RevC.02
basis: 6-31+G(d,p)
method: UwB97XD TD-FC
operation: Force
keyword: #p
keyword: td=(nstates=30,root=2)
keyword: uwb97xd/6-31+g(d,p)
keyword: force
keyword: scrf=(CPCM,solvent=chloroform)
keyword: nosymm
keyword: scf=xqc
keyword: Guess=mix
keyword: density=current
title: #p td=(nstates=30,root=2) uwb97xd/6-31+g(d,p) force scrf=(CPCM,solvent
basis: NPDir=0 NMtPBC= 1 NCelOv= 1 NCel= 1 NClECP= 1 NCelD= 1
basis: NCelK= 1 NCelE2= 1 NClLst= 1 CellRange= 0.0.
basis: One-electron integrals computed using PRISM.
basis: NBasis= 859 RedAO= T EigKep= 1.08D-06 NBF= 859
basis: NBsUse= 854 1.00D-06 EigRej= 7.34D-07 NBFU= 854
converged: NO NO NO NO
hfenergy: -1479.2071777 hartree
pointgroup: C01 [X(C32H35N3O1)]
dipole: -1.8716963 0.3328425 -2.7183364 debye
InChI: InChI=1/32C.3N.O.35H
charge 2 multiplicity 1
71 atoms
C  0.5251469 -2.63978455 -0.66211286
C  -0.57734882 -2.38393724 -1.56789942
C  -0.80492392 -1.09496304 -1.96058695
C  0.05627646 -0.06147255 -1.47423021
C  1.13963887 -0.32621597 -0.60816306
C  1.40274984 -1.60645731 -0.18639323
C  -0.59931665 -4.59209656 -0.92922221
C  -1.28612395 -3.67549467 -1.74361679
H  -1.62790385 -0.79894823 -2.59792473
H  -0.14576777 0.95869753 -1.77819933
H  1.7627009 0.49285277 -0.27002222
H  2.22210019 -1.83913911 0.47850386
N  0.47469963 -3.92433204 -0.30111285
H  -0.72948646 -5.65308523 -0.81444509
C  1.29887137 -4.50170862 0.76792151
O  2.47300505 -4.24972619 0.76636214
C  0.54212511 -5.26221786 1.81209123
H  -0.09178999 -6.03072959 1.35919615
H  1.29129172 -5.75795154 2.43107972
C  -0.32117263 -4.3114262 2.68540457
H  0.3063561 -3.50139958 3.07126702
H  -0.6421166 -4.90426341 3.54886561
C  -1.53284291 -3.75432251 1.99194747
H  -2.25980022 -4.48401995 1.63565619
C  -1.76516879 -2.45487392 1.80102299
H  -1.06449594 -1.69581729 2.14211279
H  -2.66701571 -2.11098632 1.30432596
C  -2.41101024 -3.93860133 -2.49224042
H  -2.91975173 -4.89003952 -2.3832849
N  -2.95510368 -3.06989191 -3.3925733
H  -2.47003736 -2.20752114 -3.58344052
C  -2.95153182 -0.14242329 -4.98829398
C  -4.1304664 -0.64492753 -4.4268351
C  -4.82314686 0.13415907 -3.49279819
C  -4.33340828 1.37980706 -3.1152291
C  -3.14453901 1.86348452 -3.66171025
C  -2.45671002 1.10293485 -4.60336321
H  -2.41646834 -0.72286327 -5.73507765
H  -5.74879868 -0.21900336 -3.04972279
H  -4.88273556 1.9743383 -2.39298261
H  -2.76539796 2.83510954 -3.36336836
H  -1.54128956 1.47852244 -5.04838019
C  -4.58474043 -2.03225999 -4.83454125
H  -4.00656538 -2.33906794 -5.71065519
C  -4.36184403 -3.11795328 -3.73436423
H  -4.5593125 -4.09356299 -4.19577585
C  -5.28106386 -2.99070103 -2.52675711
C  -6.49970835 -3.67592189 -2.52184945
C  -4.93489628 -2.21856399 -1.41485536
C  -7.38263307 -3.5522954 -1.44898473
H  -6.75268109 -4.34219535 -3.34196459
C  -5.81018092 -2.10027631 -0.33956001
H  -3.9782262 -1.70551526 -1.38606814
C  -7.0400946 -2.758112 -0.35840645
H  -8.32459602 -4.0897239 -1.46285902
H  -5.53231765 -1.49256897 0.51563967
H  -7.72061733 -2.66432827 0.48111521
C  -6.40026712 -0.86941289 -6.17414715
C  -6.41575713 -3.31200838 -6.05785335
C  -7.48128478 -1.42537471 -7.08213144
H  -5.50734287 -0.59305837 -6.73755987
H  -6.69997294 -0.03498842 -5.54362663
C  -6.95161 -2.8224167 -7.39998692
H  -7.18398678 -3.81699033 -5.47362818
H  -5.54613036 -3.9614446 -6.14396751
H  -8.44063339 -1.4762709 -6.55816525
H  -7.60578975 -0.80099214 -7.96754073
H  -7.7157855 -3.49942295 -7.78279058
H  -6.14382465 -2.76555845 -8.1349498
N  -6.02082177 -2.04719032 -5.28915214
H  -6.60568668 -2.00735046 -4.44847957
