program: Gaussian 16
title: Title Card Required
version: ES64L-G16RevC.02
basis: 6-31+G(d,p)
method: UwB97XD TD-FC
operation: Force
keyword: #p
keyword: td=(nstates=30,root=1)
keyword: uwb97xd/6-31+g(d,p)
keyword: force
keyword: scrf=(CPCM,solvent=chloroform)
keyword: nosymm
keyword: scf=xqc
keyword: Guess=mix
keyword: density=current
title: #p td=(nstates=30,root=1) uwb97xd/6-31+g(d,p) force scrf=(CPCM,solvent
basis: NPDir=0 NMtPBC= 1 NCelOv= 1 NCel= 1 NClECP= 1 NCelD= 1
basis: NCelK= 1 NCelE2= 1 NClLst= 1 CellRange= 0.0.
basis: One-electron integrals computed using PRISM.
basis: NBasis= 859 RedAO= T EigKep= 1.09D-06 NBF= 859
basis: NBsUse= 854 1.00D-06 EigRej= 7.31D-07 NBFU= 854
converged: NO NO NO NO
hfenergy: -1479.2075532 hartree
pointgroup: C01 [X(C32H35N3O1)]
dipole: -3.9988513 -0.5134151 -3.9870612 debye
InChI: InChI=1/32C.3N.O.35H
charge 2 multiplicity 1
71 atoms
C  0.52512943 -2.6454749 -0.67106336
C  -0.5680018 -2.39090032 -1.58972186
C  -0.80478248 -1.09501367 -1.96655452
C  0.05258204 -0.04825351 -1.47333386
C  1.13174431 -0.32964936 -0.60800682
C  1.39328612 -1.60538734 -0.1942615
C  -0.59886571 -4.60158189 -0.93259723
C  -1.26953225 -3.67731768 -1.75721244
H  -1.63059447 -0.78205088 -2.58868041
H  -0.13557985 0.96452083 -1.76960962
H  1.75556976 0.49403538 -0.27377875
H  2.21233869 -1.83271635 0.46886408
N  0.45999927 -3.92665042 -0.29455455
H  -0.72829701 -5.66767089 -0.81311081
C  1.28555305 -4.50311692 0.76759511
O  2.46388612 -4.2475787 0.75537555
C  0.53773318 -5.26443158 1.81143694
H  -0.09327633 -6.03851048 1.36703585
H  1.29075109 -5.75766586 2.43394254
C  -0.32095058 -4.3112864 2.68478391
H  0.30946785 -3.50312728 3.06853646
H  -0.6425598 -4.90280764 3.54878645
C  -1.53091455 -3.7586962 1.99052954
H  -2.2559256 -4.48481803 1.63328061
C  -1.76497348 -2.45101859 1.79975999
H  -1.06421841 -1.69645129 2.14248051
H  -2.66682438 -2.11238719 1.3059289
C  -2.40790359 -3.93021196 -2.48655226
H  -2.91522159 -4.87769169 -2.34290163
N  -2.94745937 -3.07722802 -3.3915558
H  -2.44960364 -2.2207273 -3.58906694
C  -2.95203757 -0.14099891 -4.9875033
C  -4.12798123 -0.64577594 -4.42301687
C  -4.8220848 0.13463223 -3.49143269
C  -4.33331483 1.3818517 -3.11570806
C  -3.14465805 1.86548803 -3.66176877
C  -2.45775548 1.10511327 -4.60405385
H  -2.41869571 -0.71863176 -5.73816365
H  -5.74964782 -0.21581163 -3.04986406
H  -4.8824398 1.97648016 -2.39339602
H  -2.7636495 2.83599404 -3.36131788
H  -1.54193141 1.48044363 -5.04848126
C  -4.58189759 -2.03397502 -4.83180679
H  -4.00297467 -2.3386066 -5.70868691
C  -4.35730076 -3.12257246 -3.73392138
H  -4.55919023 -4.09818882 -4.19549379
C  -5.27795906 -2.99444026 -2.52572303
C  -6.49923939 -3.67649717 -2.52138916
C  -4.93527397 -2.21863612 -1.41503955
C  -7.3830709 -3.55149561 -1.45012801
H  -6.75495694 -4.34161132 -3.34199565
C  -5.81251096 -2.09974521 -0.34051548
H  -3.98184396 -1.70052033 -1.38616344
C  -7.04184383 -2.75820981 -0.35859892
H  -8.32510739 -4.09017042 -1.4631077
H  -5.53548462 -1.49179319 0.51440802
H  -7.72119715 -2.66664499 0.48208285
C  -6.40022179 -0.8693087 -6.17315638
C  -6.41540666 -3.31168348 -6.05685499
C  -7.48133365 -1.42588994 -7.08128003
H  -5.50824512 -0.59141985 -6.73765105
H  -6.70180449 -0.03486874 -5.54372969
C  -6.9512099 -2.82236956 -7.39903472
H  -7.18453323 -3.81609603 -5.47302627
H  -5.54625249 -3.96160679 -6.14398922
H  -8.44162317 -1.47692397 -6.55904109
H  -7.60589906 -0.80186969 -7.96704765
H  -7.71491086 -3.49963041 -7.78229651
H  -6.14353117 -2.76475584 -8.13422961
N  -6.01856701 -2.04728658 -5.28816258
H  -6.60404872 -2.00636274 -4.44682689
