program: Gaussian 16
title: Title Card Required
version: ES64L-G16RevC.02
basis: 6-31+G(d,p)
method: UwB97XD TD-FC
operation: Force
keyword: #p
keyword: td=(nstates=30,root=2)
keyword: uwb97xd/6-31+g(d,p)
keyword: force
keyword: scrf=(CPCM,solvent=chloroform)
keyword: nosymm
keyword: scf=xqc
keyword: Guess=mix
keyword: density=current
title: #p td=(nstates=30,root=2) uwb97xd/6-31+g(d,p) force scrf=(CPCM,solvent
basis: NPDir=0 NMtPBC= 1 NCelOv= 1 NCel= 1 NClECP= 1 NCelD= 1
basis: NCelK= 1 NCelE2= 1 NClLst= 1 CellRange= 0.0.
basis: One-electron integrals computed using PRISM.
basis: NBasis= 859 RedAO= T EigKep= 1.10D-06 NBF= 859
basis: NBsUse= 854 1.00D-06 EigRej= 7.48D-07 NBFU= 854
converged: NO NO NO NO
hfenergy: -1479.2065321 hartree
pointgroup: C01 [X(C32H35N3O1)]
dipole: -2.5235228 -0.0440346 -3.0965857 debye
InChI: InChI=1/32C.3N.O.35H
charge 2 multiplicity 1
71 atoms
C  0.52364693 -2.65211551 -0.67085856
C  -0.56259187 -2.38733238 -1.58973785
C  -0.80248667 -1.0940484 -1.96593259
C  0.05067364 -0.05467349 -1.47158589
C  1.12944279 -0.32140544 -0.60924083
C  1.38937272 -1.60783969 -0.19708283
C  -0.59967678 -4.60482042 -0.93384022
C  -1.26983402 -3.68327742 -1.75775467
H  -1.63142156 -0.77969278 -2.58715212
H  -0.13323337 0.96776198 -1.76915411
H  1.75458506 0.49372535 -0.27539185
H  2.21318606 -1.83175705 0.46930229
N  0.45926426 -3.92269084 -0.29467911
H  -0.72874556 -5.6721335 -0.81294363
C  1.28856186 -4.49875683 0.7631937
O  2.45871102 -4.24891872 0.75585721
C  0.53681211 -5.26577759 1.81493159
H  -0.09270401 -6.03912644 1.36757438
H  1.28970054 -5.75775262 2.43414917
C  -0.31987479 -4.31284868 2.68496501
H  0.30961401 -3.50311563 3.06848113
H  -0.64194832 -4.90209833 3.54761867
C  -1.53188005 -3.7503945 1.98917702
H  -2.25628106 -4.48591991 1.63272984
C  -1.76322322 -2.45876195 1.8008802
H  -1.0637464 -1.69561539 2.1429315
H  -2.66771975 -2.11210914 1.3057899
C  -2.40570164 -3.92533918 -2.48488029
H  -2.91316853 -4.87536317 -2.34014962
N  -2.94854344 -3.08031756 -3.39313507
H  -2.44503505 -2.22171625 -3.58960264
C  -2.952382 -0.14092484 -4.9875246
C  -4.12758089 -0.64627696 -4.42258774
C  -4.82230392 0.13486731 -3.49124714
C  -4.33349988 1.38220139 -3.1158382
C  -3.14467432 1.86575632 -3.66186181
C  -2.45778664 1.10558019 -4.60433882
H  -2.41894894 -0.71811486 -5.73857649
H  -5.7496615 -0.21538525 -3.05009398
H  -4.88221901 1.97662395 -2.39333064
H  -2.76339024 2.83618597 -3.36102627
H  -1.54196254 1.48054217 -5.04821992
C  -4.58145293 -2.03408542 -4.83157126
H  -4.00299487 -2.33835729 -5.70832875
C  -4.3559678 -3.12270866 -3.73362132
H  -4.5596833 -4.09943978 -4.19601743
C  -5.27837595 -2.99543244 -2.52601421
C  -6.49945997 -3.6759022 -2.52088448
C  -4.93548145 -2.21794589 -1.41425782
C  -7.38349791 -3.55157363 -1.45046302
H  -6.7552281 -4.34152467 -3.34197204
C  -5.81218761 -2.09943191 -0.34086822
H  -3.98261085 -1.70004422 -1.38625716
C  -7.04210913 -2.75822777 -0.35865003
H  -8.32505806 -4.09026092 -1.46287946
H  -5.53585489 -1.49198756 0.51441214
H  -7.72157435 -2.66688502 0.48257264
C  -6.40049005 -0.86933779 -6.17321113
C  -6.41551328 -3.31186591 -6.05661341
C  -7.48126763 -1.42578867 -7.08134122
H  -5.50832419 -0.59113485 -6.73786049
H  -6.7021479 -0.03472357 -5.5438916
C  -6.95109228 -2.82228097 -7.39911053
H  -7.18455507 -3.81588584 -5.47315788
H  -5.54635998 -3.96137281 -6.14400739
H  -8.44189842 -1.47698568 -6.55927805
H  -7.60607331 -0.80205859 -7.96697871
H  -7.71483031 -3.49967324 -7.78232532
H  -6.14368038 -2.76466332 -8.13414796
N  -6.01839064 -2.04738716 -5.28775949
H  -6.60426334 -2.00611908 -4.44666851
