program: Gaussian 16
title: Title Card Required
version: ES64L-G16RevC.02
basis: 6-31+G(d,p)
method: UwB97XD TD-FC
operation: Force
keyword: #p
keyword: td=(nstates=30,root=2)
keyword: uwb97xd/6-31+g(d,p)
keyword: force
keyword: scrf=(CPCM,solvent=chloroform)
keyword: nosymm
keyword: scf=xqc
keyword: Guess=mix
keyword: density=current
title: #p td=(nstates=30,root=2) uwb97xd/6-31+g(d,p) force scrf=(CPCM,solvent
basis: NPDir=0 NMtPBC= 1 NCelOv= 1 NCel= 1 NClECP= 1 NCelD= 1
basis: NCelK= 1 NCelE2= 1 NClLst= 1 CellRange= 0.0.
basis: One-electron integrals computed using PRISM.
basis: NBasis= 859 RedAO= T EigKep= 1.10D-06 NBF= 859
basis: NBsUse= 854 1.00D-06 EigRej= 7.59D-07 NBFU= 854
converged: NO NO NO NO
hfenergy: -1479.1983772 hartree
pointgroup: C01 [X(C32H35N3O1)]
dipole: -2.7057444 -0.3943941 -3.3324348 debye
InChI: InChI=1/32C.3N.O.35H
charge 2 multiplicity 1
71 atoms
C  0.49251028 -2.6866492 -0.67858154
C  -0.57758747 -2.41388814 -1.57799964
C  -0.82455932 -1.07771024 -1.96544651
C  0.05675525 -0.04094334 -1.46775568
C  1.13781818 -0.29053902 -0.60739607
C  1.41945524 -1.59891584 -0.15634286
C  -0.57920856 -4.60391327 -0.94290121
C  -1.24194959 -3.68101023 -1.75564483
H  -1.6821636 -0.8125349 -2.59209121
H  -0.13995404 0.98612627 -1.7861564
H  1.76773441 0.52720682 -0.28539969
H  2.24826085 -1.84010705 0.49573702
N  0.47853751 -3.97277746 -0.31583452
H  -0.73709406 -5.67491291 -0.81805085
C  1.32707152 -4.51257321 0.76296502
O  2.45367255 -4.24290548 0.79123705
C  0.54659033 -5.27323914 1.82917365
H  -0.08752234 -6.03701783 1.36638444
H  1.29170502 -5.76404128 2.44854456
C  -0.31961885 -4.31080552 2.68654347
H  0.3075645 -3.4991579 3.07180003
H  -0.64425118 -4.9004916 3.54908106
C  -1.5277251 -3.75425221 1.98699827
H  -2.25627655 -4.48304421 1.6315413
C  -1.76586858 -2.45290594 1.80220648
H  -1.06818166 -1.69365 2.14660916
H  -2.66832184 -2.11037922 1.31019352
C  -2.41177675 -3.93497108 -2.50382539
H  -2.94028345 -4.86633778 -2.37244039
N  -2.95511733 -3.08685963 -3.33849574
H  -2.39909914 -2.27987352 -3.67386866
C  -2.95486762 -0.13612301 -4.99150814
C  -4.13182378 -0.63855267 -4.4275442
C  -4.82552841 0.14012567 -3.49299238
C  -4.33404285 1.38514576 -3.11478868
C  -3.14448955 1.86705969 -3.66148178
C  -2.45747445 1.10800434 -4.60444122
H  -2.42168576 -0.71347121 -5.74226171
H  -5.7515844 -0.21182791 -3.05091953
H  -4.88119118 1.97911836 -2.3906638
H  -2.76288328 2.83698939 -3.36054914
H  -1.5401585 1.48116139 -5.04622566
C  -4.58278741 -2.02766991 -4.83212001
H  -4.01174434 -2.32982115 -5.71464878
C  -4.35411275 -3.11815333 -3.72855597
H  -4.54665353 -4.09444596 -4.19714625
C  -5.28469015 -2.98832555 -2.5255784
C  -6.50352815 -3.67409134 -2.52144951
C  -4.9410071 -2.21167706 -1.41329868
C  -7.38589236 -3.55148635 -1.44824647
H  -6.75720118 -4.34109281 -3.34141823
C  -5.81519067 -2.09758898 -0.33804355
H  -3.98775038 -1.69244694 -1.38372428
C  -7.04453909 -2.75856244 -0.35695697
H  -8.32624398 -4.09134338 -1.46101573
H  -5.53816691 -1.49296156 0.51900198
H  -7.72431107 -2.66863502 0.48435212
C  -6.4049861 -0.86690461 -6.17510632
C  -6.41701256 -3.31039441 -6.05659032
C  -7.48387092 -1.42554848 -7.0834923
H  -5.51169262 -0.58995644 -6.73854825
H  -6.70608805 -0.03183277 -5.54589446
C  -6.95157744 -2.82183727 -7.40026994
H  -7.18560671 -3.81541034 -5.47397249
H  -5.54670226 -3.95860848 -6.14247911
H  -8.44437451 -1.47762803 -6.56090438
H  -7.60836063 -0.80237232 -7.96943464
H  -7.7144879 -3.50048603 -7.78304157
H  -6.14351057 -2.76432499 -8.13433475
N  -6.02209341 -2.04478082 -5.28757708
H  -6.61028259 -2.00242995 -4.44825131
