program: Gaussian 16
title: Title Card Required
version: ES64L-G16RevC.02
basis: 6-31+G(d,p)
method: UwB97XD TD-FC
operation: Force
keyword: #p
keyword: td=(nstates=30,root=1)
keyword: uwb97xd/6-31+g(d,p)
keyword: force
keyword: scrf=(CPCM,solvent=chloroform)
keyword: nosymm
keyword: scf=xqc
keyword: Guess=mix
keyword: density=current
title: #p td=(nstates=30,root=1) uwb97xd/6-31+g(d,p) force scrf=(CPCM,solvent
basis: NPDir=0 NMtPBC= 1 NCelOv= 1 NCel= 1 NClECP= 1 NCelD= 1
basis: NCelK= 1 NCelE2= 1 NClLst= 1 CellRange= 0.0.
basis: One-electron integrals computed using PRISM.
basis: NBasis= 859 RedAO= T EigKep= 1.06D-06 NBF= 859
basis: NBsUse= 854 1.00D-06 EigRej= 7.59D-07 NBFU= 854
converged: NO NO NO NO
hfenergy: -1479.2076869 hartree
pointgroup: C01 [X(C32H35N3O1)]
dipole: -3.7991681 -0.5332088 -3.8491457 debye
InChI: InChI=1/32C.3N.O.35H
charge 2 multiplicity 1
71 atoms
C  0.51672324 -2.6206543 -0.61956278
C  -0.55810832 -2.34865098 -1.5482042
C  -0.74442786 -1.05555387 -1.95531241
C  0.12560341 -0.03841447 -1.45825735
C  1.17056617 -0.31724823 -0.55525313
C  1.38987794 -1.60150608 -0.11578668
C  -0.58657037 -4.57265755 -0.96114787
C  -1.259827 -3.63953461 -1.77155124
H  -1.53077042 -0.74172201 -2.62970754
H  -0.03300239 0.98202921 -1.787822
H  1.80471813 0.48872487 -0.20745218
H  2.18303859 -1.84387078 0.57865813
N  0.46692258 -3.91373337 -0.28930729
H  -0.71748879 -5.63696645 -0.8669726
C  1.27667269 -4.50678552 0.78020871
O  2.44746041 -4.24467518 0.80586083
C  0.50494517 -5.2890493 1.79785432
H  -0.14212279 -6.02805104 1.31852156
H  1.24139245 -5.81556916 2.40610808
C  -0.34293136 -4.34360088 2.69211727
H  0.29396844 -3.5451438 3.08707437
H  -0.66433619 -4.94837683 3.54608515
C  -1.55276042 -3.76381155 2.01239521
H  -2.29326016 -4.48121967 1.65944418
C  -1.76562698 -2.46054422 1.83130894
H  -1.04982559 -1.71530154 2.17223654
H  -2.6658008 -2.09737016 1.34517874
C  -2.35427585 -3.90333406 -2.56373113
H  -2.79704696 -4.89303081 -2.54992531
N  -2.93962339 -3.00293584 -3.41104792
H  -2.56710271 -2.06698178 -3.41855316
C  -2.96538315 -0.14856729 -4.99896278
C  -4.15460557 -0.64251567 -4.45312276
C  -4.85056645 0.13509732 -3.52058801
C  -4.35523995 1.3756661 -3.13245834
C  -3.15709042 1.85166162 -3.66450657
C  -2.46405519 1.09010707 -4.60189726
H  -2.42388607 -0.73576515 -5.73567937
H  -5.78002466 -0.21694975 -3.08401593
H  -4.90520807 1.96937887 -2.41027602
H  -2.77185546 2.81769509 -3.35595755
H  -1.53760956 1.4570292 -5.03040437
C  -4.6021843 -2.03330549 -4.85382565
H  -4.02595375 -2.34374895 -5.72936184
C  -4.35057679 -3.09981609 -3.73880762
H  -4.51465237 -4.08751962 -4.18419782
C  -5.26845751 -2.97901813 -2.52786351
C  -6.4961482 -3.64774269 -2.52626656
C  -4.90989458 -2.22602253 -1.40593253
C  -7.3725029 -3.52908937 -1.4482213
H  -6.7624547 -4.29937353 -3.35443084
C  -5.77703887 -2.11654673 -0.32334339
H  -3.94949094 -1.72205813 -1.37067797
C  -7.01510879 -2.75824513 -0.34554355
H  -8.32220013 -4.05327826 -1.4658095
H  -5.48539221 -1.52875839 0.54099816
H  -7.68962276 -2.66945336 0.49948473
C  -6.41893285 -0.88828316 -6.20246279
C  -6.43817429 -3.32877345 -6.05881725
C  -7.50056648 -1.45178249 -7.10473315
H  -5.52538154 -0.62114434 -6.7696416
H  -6.7161441 -0.04540127 -5.58226486
C  -6.9733759 -2.85333642 -7.40702556
H  -7.20946585 -3.82494778 -5.47134862
H  -5.57027312 -3.98161266 -6.13612951
H  -8.46072048 -1.49472818 -6.58131009
H  -7.62318821 -0.83688572 -7.99708988
H  -7.73955717 -3.53284811 -7.78142784
H  -6.16671821 -2.80652342 -8.14382264
N  -6.04051882 -2.05682593 -5.30341316
H  -6.62583901 -2.00648818 -4.46363951
