program: Gaussian 16
title: Title Card Required
version: ES64L-G16RevC.02
basis: 6-31+G(d,p)
method: UwB97XD TD-FC
operation: Force
keyword: #p
keyword: td=(nstates=30,root=3)
keyword: uwb97xd/6-31+g(d,p)
keyword: force
keyword: scrf=(CPCM,solvent=chloroform)
keyword: nosymm
keyword: scf=xqc
keyword: Guess=mix
keyword: density=current
title: #p td=(nstates=30,root=3) uwb97xd/6-31+g(d,p) force scrf=(CPCM,solvent
basis: NPDir=0 NMtPBC= 1 NCelOv= 1 NCel= 1 NClECP= 1 NCelD= 1
basis: NCelK= 1 NCelE2= 1 NClLst= 1 CellRange= 0.0.
basis: One-electron integrals computed using PRISM.
basis: NBasis= 859 RedAO= T EigKep= 1.12D-06 NBF= 859
basis: NBsUse= 854 1.00D-06 EigRej= 8.97D-07 NBFU= 854
converged: NO NO NO NO
hfenergy: -1479.2068511 hartree
pointgroup: C01 [X(C32H35N3O1)]
dipole: -2.0952644 2.0893634 -2.8152557 debye
InChI: InChI=1/32C.3N.O.35H
charge 2 multiplicity 1
71 atoms
C  0.56533466 -2.26107323 -0.48718975
C  -0.64128475 -1.97314566 -1.20255674
C  -0.8662518 -0.68816383 -1.71897862
C  0.08415503 0.29640122 -1.46783054
C  1.24450894 0.00812704 -0.72279378
C  1.50650062 -1.26682538 -0.2185846
C  -0.62809383 -4.16511865 -0.66894679
C  -1.39815639 -3.18894136 -1.2982484
H  -1.74995529 -0.47745758 -2.30803056
H  -0.05932189 1.29666186 -1.86046496
H  1.96749747 0.79566389 -0.54780279
H  2.40747432 -1.47561795 0.34016276
N  0.5488901 -3.60908254 -0.17686106
H  -0.83318445 -5.21821312 -0.57933467
C  1.49887315 -4.2643034 0.66670178
O  2.52618419 -3.68565595 0.94240769
C  1.12089417 -5.60569429 1.23552841
H  0.66942563 -6.2596893 0.48531241
H  2.06139348 -6.06142742 1.54764077
C  0.19315009 -5.46451282 2.47206988
H  0.61072808 -4.71521904 3.15241145
H  0.22899006 -6.42647666 2.99330911
C  -1.23840476 -5.13953411 2.14947696
H  -1.80060773 -5.91793515 1.63233971
C  -1.85140775 -3.9974346 2.46551526
H  -1.33170443 -3.1978552 2.98841955
H  -2.89473724 -3.82933194 2.21546936
C  -2.65774364 -3.33709254 -1.94567582
H  -2.92792397 -4.24591521 -2.46807857
N  -3.61847425 -2.38130937 -1.78391355
H  -3.5295052 -1.77591186 -0.97380985
C  -4.86910637 0.27602518 -0.30172687
C  -5.73575873 -0.77186132 -0.62825189
C  -6.52412635 -1.3416487 0.37743458
C  -6.43720599 -0.87809926 1.6854878
C  -5.55554162 0.15356274 2.00724837
C  -4.77234803 0.73112138 1.01205833
H  -4.26998333 0.74595667 -1.07732544
H  -7.21206902 -2.15218369 0.15692712
H  -7.05634463 -1.32712316 2.45441553
H  -5.48823487 0.51033641 3.02947077
H  -4.09392073 1.5430462 1.25138236
C  -5.74851137 -1.27677651 -2.05543428
H  -5.26335818 -0.53400737 -2.69497854
C  -4.97566784 -2.62150844 -2.23823453
H  -4.91925081 -2.8310062 -3.31227711
C  -5.63400073 -3.82193535 -1.56598215
C  -6.54396315 -4.60033057 -2.28646061
C  -5.34371975 -4.16912409 -0.24322948
C  -7.18878786 -5.68045853 -1.68386384
H  -6.73113225 -4.39038247 -3.33665851
C  -5.97735334 -5.25248301 0.35602426
H  -4.62268597 -3.59057881 0.32540408
C  -6.90943793 -6.00489237 -0.35936268
H  -7.89264382 -6.27512542 -2.25643719
H  -5.7444413 -5.50958508 1.38422339
H  -7.40327827 -6.84886155 0.11040927
C  -8.04027518 -0.21239363 -2.25987499
C  -7.21993533 -1.57731784 -4.11667515
C  -9.00219798 -0.12751907 -3.42995482
H  -7.39270647 0.6647888 -2.20775381
H  -8.49850189 -0.37856289 -1.28738729
C  -8.09599105 -0.43375663 -4.62085638
H  -7.6717415 -2.5501655 -4.30813309
H  -6.2101053 -1.56461552 -4.52308628
H  -9.79685385 -0.87380677 -3.33497606
H  -9.46343676 0.85924807 -3.48375848
H  -8.64277729 -0.72994456 -5.51653127
H  -7.48214589 0.43722012 -4.86639544
N  -7.14958992 -1.40033201 -2.59693029
H  -7.570372 -2.23316508 -2.17353342
