program: Gaussian 16
title: Title Card Required
version: ES64L-G16RevC.02
basis: 6-31+G(d,p)
method: UwB97XD TD-FC
operation: Force
keyword: #p
keyword: td=(nstates=30,root=2)
keyword: uwb97xd/6-31+g(d,p)
keyword: force
keyword: scrf=(CPCM,solvent=chloroform)
keyword: nosymm
keyword: scf=xqc
keyword: Guess=mix
keyword: density=current
title: #p td=(nstates=30,root=2) uwb97xd/6-31+g(d,p) force scrf=(CPCM,solvent
basis: NPDir=0 NMtPBC= 1 NCelOv= 1 NCel= 1 NClECP= 1 NCelD= 1
basis: NCelK= 1 NCelE2= 1 NClLst= 1 CellRange= 0.0.
basis: One-electron integrals computed using PRISM.
basis: NBasis= 859 RedAO= T EigKep= 1.12D-06 NBF= 859
basis: NBsUse= 854 1.00D-06 EigRej= 8.98D-07 NBFU= 854
converged: NO NO NO NO
hfenergy: -1479.206692 hartree
pointgroup: C01 [X(C32H35N3O1)]
dipole: -2.0806278 2.0971423 -2.8149979 debye
InChI: InChI=1/32C.3N.O.35H
charge 2 multiplicity 1
71 atoms
C  0.56507284 -2.26185925 -0.48749421
C  -0.6415778 -1.97297941 -1.20336169
C  -0.865503 -0.68983202 -1.71828216
C  0.0843269 0.29723441 -1.46820224
C  1.24409614 0.00741552 -0.7225913
C  1.5073121 -1.26576346 -0.21803335
C  -0.62870479 -4.16534223 -0.66926683
C  -1.39845111 -3.18949362 -1.29856232
H  -1.75079502 -0.47775721 -2.30762466
H  -0.05872464 1.29547863 -1.86081076
H  1.96827622 0.79607069 -0.54813851
H  2.4067097 -1.47514521 0.33970855
N  0.54974659 -3.60853003 -0.17669171
H  -0.83348916 -5.21853182 -0.57949395
C  1.49972541 -4.26390408 0.66694872
O  2.52618959 -3.68567744 0.94245697
C  1.12110631 -5.60546772 1.23560068
H  0.66915035 -6.25927426 0.48540697
H  2.06149049 -6.06108724 1.54785762
C  0.19309815 -5.4644141 2.47215343
H  0.61024524 -4.71530477 3.15246815
H  0.22893628 -6.42637397 2.99308147
C  -1.23871027 -5.139792 2.14934549
H  -1.80074873 -5.9182241 1.6323372
C  -1.85168252 -3.99758889 2.46547444
H  -1.33201141 -3.19786546 2.98824374
H  -2.89469957 -3.82915522 2.21497615
C  -2.65653954 -3.33624476 -1.9449851
H  -2.92816429 -4.24530485 -2.46848991
N  -3.61890921 -2.38061006 -1.78370289
H  -3.52998145 -1.77558137 -0.9731792
C  -4.86884906 0.27622502 -0.30190477
C  -5.73602474 -0.7720781 -0.62828701
C  -6.52399189 -1.34162258 0.37713246
C  -6.43736094 -0.87845735 1.68555582
C  -5.55522202 0.15372797 2.00698579
C  -4.77259776 0.73085644 1.01234549
H  -4.26996696 0.74589896 -1.07717504
H  -7.21216898 -2.15214393 0.15677371
H  -7.0561213 -1.32728996 2.45418588
H  -5.48842758 0.5103098 3.02944145
H  -4.09389687 1.54304897 1.25142944
C  -5.7482702 -1.27634698 -2.05557756
H  -5.26352368 -0.53376442 -2.69486584
C  -4.9755577 -2.62152827 -2.2386775
H  -4.9198482 -2.83078327 -3.31223222
C  -5.63360189 -3.82186853 -1.56607358
C  -6.54389842 -4.60060298 -2.28639055
C  -5.3436991 -4.16939568 -0.24318065
C  -7.18866111 -5.68040534 -1.68380144
H  -6.73146183 -4.39059613 -3.33655507
C  -5.97720551 -5.2523955 0.35611793
H  -4.62296708 -3.59063058 0.3258825
C  -6.90964705 -6.00512288 -0.35935053
H  -7.89262546 -6.27522354 -2.25634125
H  -5.74470039 -5.50967952 1.38413733
H  -7.40332227 -6.84891233 0.11042999
C  -8.04019153 -0.21242483 -2.2598924
C  -7.2198071 -1.57734265 -4.11672226
C  -9.00209746 -0.12755755 -3.42989565
H  -7.3927219 0.66474754 -2.2076413
H  -8.49835215 -0.37869532 -1.28726721
C  -8.09593798 -0.43371617 -4.62076905
H  -7.67172261 -2.55009292 -4.3080069
H  -6.21006255 -1.5646496 -4.52311955
H  -9.79684379 -0.87388679 -3.33490945
H  -9.46335301 0.8591815 -3.48362189
H  -8.64270906 -0.72997854 -5.51649492
H  -7.48209148 0.43728393 -4.8663118
N  -7.14950646 -1.40034272 -2.5969293
H  -7.57003473 -2.23316985 -2.17349189
