program: Gaussian 16
title: Title Card Required
version: ES64L-G16RevC.02
basis: 6-31+G(d,p)
method: UwB97XD TD-FC
operation: Force
keyword: #p
keyword: td=(nstates=30,root=2)
keyword: uwb97xd/6-31+g(d,p)
keyword: force
keyword: scrf=(CPCM,solvent=chloroform)
keyword: nosymm
keyword: scf=xqc
keyword: Guess=mix
keyword: density=current
title: #p td=(nstates=30,root=2) uwb97xd/6-31+g(d,p) force scrf=(CPCM,solvent
basis: NPDir=0 NMtPBC= 1 NCelOv= 1 NCel= 1 NClECP= 1 NCelD= 1
basis: NCelK= 1 NCelE2= 1 NClLst= 1 CellRange= 0.0.
basis: One-electron integrals computed using PRISM.
basis: NBasis= 859 RedAO= T EigKep= 1.12D-06 NBF= 859
basis: NBsUse= 854 1.00D-06 EigRej= 8.96D-07 NBFU= 854
converged: NO NO NO NO
hfenergy: -1479.2067601 hartree
pointgroup: C01 [X(C32H35N3O1)]
dipole: -3.3772931 1.5132477 -2.989381 debye
InChI: InChI=1/32C.3N.O.35H
charge 2 multiplicity 1
71 atoms
C  0.5653252 -2.26081982 -0.48785508
C  -0.64117003 -1.97444554 -1.20348706
C  -0.86534389 -0.68941829 -1.71861645
C  0.08433657 0.29667113 -1.4679966
C  1.24366474 0.00824781 -0.7227302
C  1.50649952 -1.2664733 -0.21793342
C  -0.62792341 -4.16528013 -0.66838753
C  -1.39768729 -3.18897648 -1.29835694
H  -1.75100765 -0.47807315 -2.30708496
H  -0.0582364 1.29490377 -1.86109602
H  1.96877759 0.79620311 -0.54841829
H  2.40625544 -1.47479162 0.33935638
N  0.54965811 -3.60971922 -0.17664336
H  -0.83383231 -5.21872349 -0.57976324
C  1.49972425 -4.26379176 0.66674913
O  2.5268007 -3.68538928 0.94274477
C  1.12124966 -5.60532271 1.23554554
H  0.66883438 -6.25902112 0.48549644
H  2.06166003 -6.06083847 1.54805214
C  0.19300638 -5.46436709 2.4719677
H  0.60994059 -4.71536789 3.15255848
H  0.22885802 -6.42625448 2.99296739
C  -1.23892527 -5.13991958 2.14945088
H  -1.80087717 -5.9185026 1.63227259
C  -1.8517418 -3.99783906 2.46545596
H  -1.3322446 -3.1978014 2.98813762
H  -2.89468025 -3.82897986 2.21463819
C  -2.65707003 -3.33576994 -1.9454931
H  -2.92809158 -4.24454701 -2.46863481
N  -3.61875792 -2.38046291 -1.78315974
H  -3.53033364 -1.77516167 -0.97261063
C  -4.86869329 0.2763688 -0.30200472
C  -5.73622366 -0.77228189 -0.62824057
C  -6.52382469 -1.34152449 0.37686767
C  -6.4374503 -0.87869427 1.68557841
C  -5.55499456 0.15383379 2.00681278
C  -4.77276778 0.73066502 1.01251385
H  -4.26994385 0.74586734 -1.07707446
H  -7.2122813 -2.15215646 0.15667584
H  -7.05597522 -1.32739077 2.45404715
H  -5.48855959 0.51031355 3.02943611
H  -4.0938722 1.54306198 1.25146981
C  -5.74824221 -1.2762532 -2.05569939
H  -5.26359074 -0.53347074 -2.69485405
C  -4.97548525 -2.62140196 -2.23879718
H  -4.92044918 -2.83076239 -3.31263769
C  -5.63329248 -3.82195452 -1.56609816
C  -6.5438758 -4.60082975 -2.28639743
C  -5.34364598 -4.16954794 -0.24325551
C  -7.18858092 -5.68033972 -1.68369778
H  -6.73170753 -4.39074765 -3.33645226
C  -5.97714805 -5.2523057 0.35609144
H  -4.62315347 -3.59065611 0.32628615
C  -6.90979002 -6.00524795 -0.3593179
H  -7.89258231 -6.27528318 -2.25626444
H  -5.74488164 -5.50978163 1.38409426
H  -7.40335609 -6.84897077 0.11042991
C  -8.04014992 -0.21247056 -2.25985996
C  -7.21974541 -1.57730763 -4.11673543
C  -9.00207505 -0.12762096 -3.42985755
H  -7.39273369 0.66471646 -2.20755782
H  -8.49822721 -0.37875793 -1.28722187
C  -8.09587809 -0.43369645 -4.62076427
H  -7.67172547 -2.55007075 -4.30791235
H  -6.2099904 -1.56467502 -4.52315154
H  -9.79683172 -0.87392037 -3.33485855
H  -9.46328923 0.85913821 -3.48353137
H  -8.64266864 -0.73001135 -5.51645125
H  -7.48203998 0.43733748 -4.86625409
N  -7.14943272 -1.40033274 -2.59694554
H  -7.56977232 -2.23313573 -2.17345602
