program: Gaussian 16
title: Title Card Required
version: ES64L-G16RevC.02
basis: 6-31+G(d,p)
method: UwB97XD TD-FC
operation: Force
keyword: #p
keyword: td=(nstates=30,root=2)
keyword: uwb97xd/6-31+g(d,p)
keyword: force
keyword: scrf=(CPCM,solvent=chloroform)
keyword: nosymm
keyword: scf=xqc
keyword: Guess=mix
keyword: density=current
title: #p td=(nstates=30,root=2) uwb97xd/6-31+g(d,p) force scrf=(CPCM,solvent
basis: NPDir=0 NMtPBC= 1 NCelOv= 1 NCel= 1 NClECP= 1 NCelD= 1
basis: NCelK= 1 NCelE2= 1 NClLst= 1 CellRange= 0.0.
basis: One-electron integrals computed using PRISM.
basis: NBasis= 859 RedAO= T EigKep= 1.12D-06 NBF= 859
basis: NBsUse= 854 1.00D-06 EigRej= 8.94D-07 NBFU= 854
converged: NO NO NO NO
hfenergy: -1479.2081483 hartree
pointgroup: C01 [X(C32H35N3O1)]
dipole: -3.4005232 1.5221892 -2.9780532 debye
InChI: InChI=1/32C.3N.O.35H
charge 2 multiplicity 1
71 atoms
C  0.57914608 -2.25465699 -0.49938947
C  -0.63337531 -1.96978526 -1.20758097
C  -0.85849476 -0.68456239 -1.72845267
C  0.09066425 0.30247112 -1.48135906
C  1.2595094 0.01117219 -0.75267085
C  1.5276394 -1.26551004 -0.25264368
C  -0.61775986 -4.15678021 -0.65486437
C  -1.39211009 -3.18392815 -1.28686551
H  -1.74073357 -0.47448592 -2.32136246
H  -0.05944324 1.30346638 -1.86592038
H  1.98669403 0.79828605 -0.58644034
H  2.43781356 -1.47675867 0.29007788
N  0.56121695 -3.6026642 -0.17436642
H  -0.82652704 -5.20853567 -0.55576408
C  1.49571006 -4.25017963 0.6880921
O  2.51247133 -3.66297589 0.99203576
C  1.1177905 -5.59761084 1.24414528
H  0.68887371 -6.25466425 0.48297511
H  2.05543313 -6.04625323 1.57489238
C  0.16609975 -5.46772311 2.46416655
H  0.57119364 -4.72250674 3.15608896
H  0.19355815 -6.43276506 2.98018886
C  -1.26051532 -5.14455567 2.12101059
H  -1.81784464 -5.92415416 1.60230553
C  -1.87855608 -3.99801491 2.42235306
H  -1.36502603 -3.19459339 2.94385048
H  -2.9182085 -3.83416423 2.15822487
C  -2.65883466 -3.3490886 -1.91412697
H  -2.94390715 -4.28866741 -2.37179703
N  -3.61253472 -2.38233391 -1.78690054
H  -3.51333527 -1.73841697 -1.00917065
C  -4.87785738 0.27532234 -0.29001584
C  -5.73650897 -0.77867437 -0.61715056
C  -6.52026814 -1.35451214 0.38973803
C  -6.43286602 -0.89232147 1.6985552
C  -5.55668214 0.14329804 2.02084955
C  -4.78042588 0.72883031 1.02456281
H  -4.28573414 0.75359653 -1.06612999
H  -7.20359963 -2.16866559 0.17000698
H  -7.04808235 -1.34603607 2.46824152
H  -5.48795158 0.49776941 3.04394679
H  -4.10780513 1.54533088 1.26361377
C  -5.74722547 -1.27934656 -2.04652787
H  -5.26455375 -0.53210633 -2.68247153
C  -4.97065101 -2.62133378 -2.23847058
H  -4.91873154 -2.82738071 -3.31335175
C  -5.62683184 -3.82224897 -1.56817048
C  -6.53244501 -4.60117467 -2.29243077
C  -5.34276456 -4.16529781 -0.24298706
C  -7.18429919 -5.67655013 -1.68990745
H  -6.70976174 -4.39362341 -3.34496362
C  -5.98334074 -5.24402317 0.35643812
H  -4.62229657 -3.58542108 0.3251289
C  -6.91453305 -5.99523522 -0.36165714
H  -7.886224 -6.27114703 -2.26469186
H  -5.75760708 -5.497819 1.38712953
H  -7.41552222 -6.8343352 0.10868823
C  -8.04097228 -0.21910442 -2.25442399
C  -7.21349957 -1.5801021 -4.11121794
C  -8.99797172 -0.13143747 -3.42860593
H  -7.39464272 0.65855572 -2.19683605
H  -8.50347581 -0.38866831 -1.2844205
C  -8.08713327 -0.43541499 -4.61640524
H  -7.66487262 -2.55261135 -4.30533621
H  -6.20265301 -1.56685245 -4.51472618
H  -9.79341317 -0.87757545 -3.33886283
H  -9.4585895 0.85562795 -3.48253402
H  -8.63034031 -0.72968776 -5.51494088
H  -7.47175317 0.43562725 -4.85787346
N  -7.14731452 -1.40523431 -2.59089145
H  -7.56770688 -2.23938737 -2.1695702
