program: Gaussian 16
title: Title Card Required
version: ES64L-G16RevC.02
basis: 6-31+G(d,p)
method: UwB97XD TD-FC
operation: Force
keyword: #p
keyword: td=(nstates=30,root=2)
keyword: uwb97xd/6-31+g(d,p)
keyword: force
keyword: scrf=(CPCM,solvent=chloroform)
keyword: nosymm
keyword: scf=xqc
keyword: Guess=mix
keyword: density=current
title: #p td=(nstates=30,root=2) uwb97xd/6-31+g(d,p) force scrf=(CPCM,solvent
basis: NPDir=0 NMtPBC= 1 NCelOv= 1 NCel= 1 NClECP= 1 NCelD= 1
basis: NCelK= 1 NCelE2= 1 NClLst= 1 CellRange= 0.0.
basis: One-electron integrals computed using PRISM.
basis: NBasis= 859 RedAO= T EigKep= 1.12D-06 NBF= 859
basis: NBsUse= 854 1.00D-06 EigRej= 8.94D-07 NBFU= 854
converged: NO NO NO NO
hfenergy: -1479.2082178 hartree
pointgroup: C01 [X(C32H35N3O1)]
dipole: -3.3920482 1.5325293 -2.9807601 debye
InChI: InChI=1/32C.3N.O.35H
charge 2 multiplicity 1
71 atoms
C  0.578718 -2.25460112 -0.49958021
C  -0.63279295 -1.97001627 -1.2073964
C  -0.85785189 -0.68373051 -1.72850334
C  0.09032163 0.30131634 -1.48115679
C  1.25945756 0.01258304 -0.75311411
C  1.52838634 -1.2663081 -0.2520815
C  -0.61728363 -4.15761261 -0.6544444
C  -1.39315543 -3.18322907 -1.28746168
H  -1.74074056 -0.47460493 -2.32159027
H  -0.05946239 1.30408615 -1.86607006
H  1.98664041 0.79793864 -0.58677245
H  2.43776727 -1.47662407 0.28941997
N  0.56184112 -3.6029377 -0.17380345
H  -0.82657575 -5.20813953 -0.55581291
C  1.49687814 -4.2489921 0.68833525
O  2.51090543 -3.6636922 0.99189387
C  1.11766703 -5.59766951 1.2442726
H  0.68897351 -6.25474866 0.48294387
H  2.0555025 -6.04621265 1.5750993
C  0.16605887 -5.46765221 2.46408729
H  0.57098437 -4.72259232 3.15600353
H  0.19337387 -6.43289998 2.98012506
C  -1.26092677 -5.1436272 2.1211235
H  -1.81802115 -5.92434965 1.60205095
C  -1.8782284 -3.99887339 2.4218493
H  -1.36517834 -3.19440599 2.94369942
H  -2.91849123 -3.83416189 2.15794028
C  -2.65843092 -3.34902175 -1.91366114
H  -2.94389251 -4.28900634 -2.37100427
N  -3.61240241 -2.38293647 -1.78792835
H  -3.51355662 -1.73821631 -1.0087731
C  -4.87768441 0.27567037 -0.28971808
C  -5.73674935 -0.77900512 -0.61712921
C  -6.52003677 -1.354324 0.38994925
C  -6.43308774 -0.8927251 1.69845673
C  -5.55642874 0.14356757 2.02110581
C  -4.78063676 0.72856112 1.0244551
H  -4.28594328 0.75370905 -1.06604259
H  -7.20367223 -2.16880008 0.17008143
H  -7.04798036 -1.34609146 2.46831933
H  -5.48800247 0.49770415 3.04394579
H  -4.10776395 1.54540354 1.26374858
C  -5.74726281 -1.27946562 -2.04647946
H  -5.26455734 -0.53198337 -2.68244376
C  -4.97075321 -2.62109964 -2.23822663
H  -4.91927844 -2.82744408 -3.31374628
C  -5.62665413 -3.82238293 -1.56797943
C  -6.53216115 -4.60085526 -2.29276836
C  -5.34254515 -4.16492858 -0.2433542
C  -7.18433286 -5.67684025 -1.68950385
H  -6.70959734 -4.39358001 -3.34484183
C  -5.98356136 -5.24435659 0.35665823
H  -4.62229644 -3.58543926 0.32526476
C  -6.91444935 -5.99491746 -0.36200695
H  -7.88619837 -6.2710363 -2.26480462
H  -5.75774434 -5.49768975 1.38705957
H  -7.415637 -6.83431582 0.10873332
C  -8.04099516 -0.21916629 -2.25434208
C  -7.21351625 -1.5801315 -4.11117629
C  -8.9979754 -0.13149367 -3.4285952
H  -7.39462599 0.65852008 -2.19677478
H  -8.50345057 -0.3887392 -1.28443972
C  -8.08706913 -0.43544723 -4.6164369
H  -7.66481941 -2.55263522 -4.30530695
H  -6.20258853 -1.566854 -4.51473068
H  -9.79335399 -0.87758458 -3.33888537
H  -9.4585404 0.85560891 -3.48252616
H  -8.63023587 -0.72969671 -5.51492045
H  -7.47166409 0.43558541 -4.85782765
N  -7.14728994 -1.40528702 -2.59082814
H  -7.56764504 -2.23938575 -2.16957202
