program: Gaussian 16
title: Title Card Required
version: ES64L-G16RevC.02
basis: 6-31+G(d,p)
method: UwB97XD TD-FC
operation: Force
keyword: #p
keyword: td=(nstates=30,root=3)
keyword: uwb97xd/6-31+g(d,p)
keyword: force
keyword: scrf=(CPCM,solvent=chloroform)
keyword: nosymm
keyword: scf=xqc
keyword: Guess=mix
keyword: density=current
title: #p td=(nstates=30,root=3) uwb97xd/6-31+g(d,p) force scrf=(CPCM,solvent
basis: NPDir=0 NMtPBC= 1 NCelOv= 1 NCel= 1 NClECP= 1 NCelD= 1
basis: NCelK= 1 NCelE2= 1 NClLst= 1 CellRange= 0.0.
basis: One-electron integrals computed using PRISM.
basis: NBasis= 859 RedAO= T EigKep= 1.12D-06 NBF= 859
basis: NBsUse= 854 1.00D-06 EigRej= 8.98D-07 NBFU= 854
converged: NO NO NO NO
hfenergy: -1479.2082724 hartree
pointgroup: C01 [X(C32H35N3O1)]
dipole: -2.1202419 2.0667462 -2.8335317 debye
InChI: InChI=1/32C.3N.O.35H
charge 2 multiplicity 1
71 atoms
C  0.57954671 -2.25454223 -0.49813739
C  -0.63149711 -1.96962861 -1.20825868
C  -0.85681054 -0.68406627 -1.7295769
C  0.09056732 0.30372964 -1.48164631
C  1.25898916 0.01178081 -0.75253878
C  1.52794068 -1.26534721 -0.25152513
C  -0.61690724 -4.1572653 -0.6556471
C  -1.39104053 -3.18362885 -1.28714448
H  -1.73992251 -0.47528583 -2.32160183
H  -0.05968609 1.30540205 -1.86630079
H  1.98730268 0.79787831 -0.58877124
H  2.44025002 -1.47696209 0.28694344
N  0.56091934 -3.6029051 -0.17311187
H  -0.82718007 -5.20831477 -0.55589674
C  1.49580327 -4.24945135 0.6893183
O  2.51031879 -3.66258916 0.99276984
C  1.11764985 -5.59787631 1.24454796
H  0.68964693 -6.25477438 0.48300622
H  2.05524003 -6.04564824 1.57593193
C  0.16533482 -5.46807093 2.46395738
H  0.57023591 -4.72245434 3.15564713
H  0.19258969 -6.43336178 2.97936574
C  -1.26129387 -5.14359306 2.12002681
H  -1.81816634 -5.92436995 1.601528
C  -1.87881808 -3.99839371 2.42027752
H  -1.36627004 -3.19415985 2.9427732
H  -2.91926059 -3.83444769 2.15688652
C  -2.65905321 -3.3499676 -1.91023479
H  -2.94308299 -4.29071412 -2.36686288
N  -3.61134357 -2.38043601 -1.79106857
H  -3.51509724 -1.74043217 -1.0092963
C  -4.87813442 0.27549154 -0.28950936
C  -5.73645886 -0.77891771 -0.61669185
C  -6.52006013 -1.35490837 0.39029812
C  -6.43273429 -0.8928097 1.69907831
C  -5.55667365 0.14307136 2.0213879
C  -4.78059723 0.72870041 1.02507021
H  -4.28685476 0.75464378 -1.06574162
H  -7.20371436 -2.16888291 0.17066986
H  -7.04771319 -1.34661403 2.46891006
H  -5.48817182 0.49768668 3.04438924
H  -4.10791895 1.54518999 1.2642273
C  -5.74716432 -1.27920802 -2.04627128
H  -5.26476173 -0.53168294 -2.68208177
C  -4.97046574 -2.6210601 -2.23941535
H  -4.9234976 -2.82776923 -3.31432061
C  -5.62563131 -3.82224659 -1.5682504
C  -6.53141497 -4.60110153 -2.29253682
C  -5.34222167 -4.16531924 -0.24307624
C  -7.1840202 -5.67635794 -1.69019674
H  -6.70891083 -4.39304335 -3.34487355
C  -5.98356128 -5.24386889 0.35618472
H  -4.62242793 -3.58545933 0.32573692
C  -6.9147512 -5.99498071 -0.36195451
H  -7.8861008 -6.27066809 -2.26506887
H  -5.75842777 -5.49715993 1.38699318
H  -7.41594121 -6.83392717 0.10885844
C  -8.0408709 -0.21938807 -2.2542531
C  -7.21327865 -1.58029207 -4.11104559
C  -8.99772278 -0.13160493 -3.428556
H  -7.39456854 0.65829951 -2.19647458
H  -8.50340149 -0.38917972 -1.28428634
C  -8.08679321 -0.43560088 -4.61626449
H  -7.66460495 -2.55282551 -4.30517577
H  -6.20251125 -1.56686093 -4.51468861
H  -9.79318343 -0.87775746 -3.33902284
H  -9.4582852 0.85547435 -3.48247448
H  -8.62973978 -0.72977563 -5.51499714
H  -7.4712316 0.43531873 -4.8576273
N  -7.14717124 -1.40536691 -2.59071581
H  -7.56751196 -2.23965234 -2.16953348
