program: Gaussian 16
title: Title Card Required
version: ES64L-G16RevC.02
basis: 6-31+G(d,p)
method: UwB97XD TD-FC
operation: Force
keyword: #p
keyword: td=(nstates=30,root=3)
keyword: uwb97xd/6-31+g(d,p)
keyword: force
keyword: scrf=(CPCM,solvent=chloroform)
keyword: nosymm
keyword: scf=xqc
keyword: Guess=mix
keyword: density=current
title: #p td=(nstates=30,root=3) uwb97xd/6-31+g(d,p) force scrf=(CPCM,solvent
basis: NPDir=0 NMtPBC= 1 NCelOv= 1 NCel= 1 NClECP= 1 NCelD= 1
basis: NCelK= 1 NCelE2= 1 NClLst= 1 CellRange= 0.0.
basis: One-electron integrals computed using PRISM.
basis: NBasis= 859 RedAO= T EigKep= 1.12D-06 NBF= 859
basis: NBsUse= 854 1.00D-06 EigRej= 8.95D-07 NBFU= 854
converged: NO NO NO NO
hfenergy: -1479.2071966 hartree
pointgroup: C01 [X(C32H35N3O1)]
dipole: -2.0989351 2.0934943 -2.8212116 debye
InChI: InChI=1/32C.3N.O.35H
charge 2 multiplicity 1
71 atoms
C  0.56664443 -2.26053993 -0.48963353
C  -0.63831875 -1.97456708 -1.20581015
C  -0.86358289 -0.68970578 -1.72127639
C  0.08528614 0.29657203 -1.47035738
C  1.24564544 0.00940785 -0.72600979
C  1.50802445 -1.26544278 -0.22173622
C  -0.62550229 -4.16581392 -0.66682116
C  -1.39558269 -3.18965682 -1.29741367
H  -1.75077609 -0.47731359 -2.30652614
H  -0.05761675 1.29566756 -1.8629823
H  1.97182625 0.79652552 -0.55446745
H  2.40985773 -1.47517621 0.33158843
N  0.55118226 -3.60885568 -0.17576555
H  -0.8336279 -5.21782297 -0.57555772
C  1.49942833 -4.26131364 0.66993278
O  2.52470319 -3.68169204 0.94885623
C  1.12082346 -5.60410055 1.23672652
H  0.67077219 -6.25728368 0.48517269
H  2.06082483 -6.05782952 1.55194477
C  0.18886339 -5.46469173 2.47076147
H  0.60367769 -4.71632852 3.15312642
H  0.22416001 -6.42723168 2.99086484
C  -1.24206374 -5.14139201 2.14524984
H  -1.80335751 -5.91990794 1.62811437
C  -1.85581701 -3.99752264 2.45917127
H  -1.3373105 -3.19745568 2.98196446
H  -2.8977823 -3.82932074 2.20618056
C  -2.65782452 -3.33731269 -1.93815563
H  -2.92998623 -4.24757881 -2.45673478
N  -3.61685418 -2.37893015 -1.78250837
H  -3.52657726 -1.76784781 -0.9761545
C  -4.87011042 0.27584519 -0.30016881
C  -5.73587377 -0.77294037 -0.62710875
C  -6.52363234 -1.34360548 0.37871841
C  -6.43656401 -0.88063431 1.68689426
C  -5.55562776 0.15188383 2.0088783
C  -4.77353916 0.73055896 1.01369883
H  -4.2715458 0.74659757 -1.07558176
H  -7.21108384 -2.15455599 0.15833941
H  -7.05483076 -1.33037523 2.45593795
H  -5.48853905 0.50836992 3.03118457
H  -4.0960994 1.54336646 1.25304507
C  -5.74796876 -1.27664358 -2.05457946
H  -5.26365259 -0.53284372 -2.69329723
C  -4.97393057 -2.62095205 -2.23850918
H  -4.92013908 -2.83063797 -3.31279383
C  -5.63208809 -3.8223784 -1.56684314
C  -6.54212046 -4.60092409 -2.28728839
C  -5.34356495 -4.16896047 -0.24357331
C  -7.18853693 -5.68017769 -1.68413699
H  -6.72944719 -4.39180573 -3.33758921
C  -5.97875825 -5.25146342 0.35594575
H  -4.62383557 -3.58995157 0.32599283
C  -6.91091349 -6.00384805 -0.35935972
H  -7.89157247 -6.27552808 -2.25685761
H  -5.74669024 -5.50838145 1.38406432
H  -7.40518504 -6.84771402 0.11059628
C  -8.04025502 -0.21347952 -2.25896956
C  -7.21884525 -1.57764322 -4.11592412
C  -9.00153561 -0.1282578 -3.42959625
H  -7.39308995 0.66388875 -2.20590555
H  -8.49886418 -0.38012065 -1.2867666
C  -8.09461626 -0.43385211 -4.62017084
H  -7.67083952 -2.55028247 -4.30742055
H  -6.20874873 -1.56506168 -4.52180664
H  -9.79642936 -0.87443159 -3.33534975
H  -9.46262427 0.85859077 -3.48323576
H  -8.64095369 -0.7299267 -5.51610953
H  -7.4806937 0.43732746 -4.86498334
N  -7.14890522 -1.40096556 -2.59616442
H  -7.56918825 -2.2339341 -2.17288969
