program: Gaussian 16
title: Title Card Required
version: ES64L-G16RevC.02
basis: 6-31+G(d,p)
method: UwB97XD TD-FC
operation: Force
keyword: #p
keyword: td=(nstates=30,root=2)
keyword: uwb97xd/6-31+g(d,p)
keyword: force
keyword: scrf=(CPCM,solvent=chloroform)
keyword: nosymm
keyword: scf=xqc
keyword: Guess=mix
keyword: density=current
title: #p td=(nstates=30,root=2) uwb97xd/6-31+g(d,p) force scrf=(CPCM,solvent
basis: NPDir=0 NMtPBC= 1 NCelOv= 1 NCel= 1 NClECP= 1 NCelD= 1
basis: NCelK= 1 NCelE2= 1 NClLst= 1 CellRange= 0.0.
basis: One-electron integrals computed using PRISM.
basis: NBasis= 859 RedAO= T EigKep= 1.12D-06 NBF= 859
basis: NBsUse= 854 1.00D-06 EigRej= 8.96D-07 NBFU= 854
converged: NO NO NO NO
hfenergy: -1479.2081311 hartree
pointgroup: C01 [X(C32H35N3O1)]
dipole: -3.3840319 1.5187703 -2.9843152 debye
InChI: InChI=1/32C.3N.O.35H
charge 2 multiplicity 1
71 atoms
C  0.57308892 -2.25812586 -0.49482326
C  -0.63512507 -1.97276994 -1.20885896
C  -0.8608306 -0.6875427 -1.72618258
C  0.0884912 0.29924005 -1.47787463
C  1.25250482 0.00961308 -0.73959917
C  1.51683585 -1.26581967 -0.23637763
C  -0.62077779 -4.16295569 -0.6617897
C  -1.39306389 -3.18832848 -1.29296175
H  -1.74767935 -0.47354246 -2.31051681
H  -0.05901689 1.29989873 -1.86630551
H  1.97773571 0.79699499 -0.56994999
H  2.42321257 -1.47773138 0.31253786
N  0.55542125 -3.60577142 -0.17487168
H  -0.82948549 -5.21424225 -0.56281012
C  1.49696476 -4.25509021 0.67910118
O  2.51793132 -3.67182361 0.96823197
C  1.1185301 -5.59989969 1.24076945
H  0.67925959 -6.25435282 0.48357321
H  2.05765219 -6.05138939 1.56261338
C  0.1772796 -5.46636508 2.46803252
H  0.58671851 -4.71887007 3.15497517
H  0.20983295 -6.43048622 2.98561677
C  -1.25161623 -5.14260301 2.13333571
H  -1.81058787 -5.9224738 1.61545556
C  -1.86675277 -3.99813698 2.44007386
H  -1.35075322 -3.19667697 2.96349076
H  -2.90808595 -3.83139577 2.18202259
C  -2.65953185 -3.34413013 -1.92150191
H  -2.93771254 -4.26354866 -2.42034579
N  -3.61339475 -2.37957104 -1.780596
H  -3.51405851 -1.74757188 -0.99240237
C  -4.87331782 0.27541782 -0.29523616
C  -5.73644303 -0.77610194 -0.62226076
C  -6.5219062 -1.34886531 0.3838611
C  -6.43528922 -0.88686666 1.69214774
C  -5.55612818 0.14781852 2.01436071
C  -4.77735317 0.72942346 1.01856988
H  -4.27711761 0.74843689 -1.07103814
H  -7.20701534 -2.16234229 0.16378297
H  -7.05168558 -1.3383487 2.46170979
H  -5.48776043 0.50230187 3.03706668
H  -4.10248319 1.54486567 1.25764188
C  -5.74720053 -1.27810953 -2.05055753
H  -5.26353154 -0.53317021 -2.68843857
C  -4.97062799 -2.62045885 -2.2361276
H  -4.91205905 -2.82926318 -3.31011906
C  -5.63030831 -3.82234512 -1.56752483
C  -6.53841091 -4.60106096 -2.29032262
C  -5.34465256 -4.16703638 -0.24402386
C  -7.18751594 -5.67896351 -1.68631708
H  -6.72062349 -4.39418204 -3.34180563
C  -5.98215749 -5.24813338 0.35645277
H  -4.62377278 -3.58731727 0.32312518
C  -6.9137255 -5.99974391 -0.36023529
H  -7.88908085 -6.27549186 -2.2598218
H  -5.75108442 -5.50355902 1.38500128
H  -7.41027744 -6.84228723 0.11036879
C  -8.04076614 -0.21608545 -2.25662308
C  -7.21624825 -1.57867661 -4.11346528
C  -8.99998428 -0.12972551 -3.42902723
H  -7.39412633 0.66153336 -2.20144656
H  -8.50165503 -0.38398127 -1.28562584
C  -8.09109946 -0.43442894 -4.61821274
H  -7.66810779 -2.55115814 -4.30658894
H  -6.20558563 -1.56608707 -4.51765041
H  -9.79521364 -0.87581624 -3.33714402
H  -9.4609899 0.85718789 -3.48289838
H  -8.63604777 -0.72947955 -5.5154011
H  -7.47690416 0.43695152 -4.86144755
N  -7.14809435 -1.40313567 -2.5934127
H  -7.56893517 -2.23655676 -2.17131815
