program: Gaussian 16
title: Title Card Required
version: ES64L-G16RevC.02
basis: 6-31+G(d,p)
method: UwB97XD TD-FC
operation: Force
keyword: #p
keyword: td=(nstates=30,root=2)
keyword: uwb97xd/6-31+g(d,p)
keyword: force
keyword: scrf=(CPCM,solvent=chloroform)
keyword: nosymm
keyword: scf=xqc
keyword: Guess=mix
keyword: density=current
title: #p td=(nstates=30,root=2) uwb97xd/6-31+g(d,p) force scrf=(CPCM,solvent
basis: NPDir=0 NMtPBC= 1 NCelOv= 1 NCel= 1 NClECP= 1 NCelD= 1
basis: NCelK= 1 NCelE2= 1 NClLst= 1 CellRange= 0.0.
basis: One-electron integrals computed using PRISM.
basis: NBasis= 859 RedAO= T EigKep= 1.12D-06 NBF= 859
basis: NBsUse= 854 1.00D-06 EigRej= 8.97D-07 NBFU= 854
converged: NO NO NO NO
hfenergy: -1479.2083281 hartree
pointgroup: C01 [X(C32H35N3O1)]
dipole: -3.3824507 1.5215219 -2.9830876 debye
InChI: InChI=1/32C.3N.O.35H
charge 2 multiplicity 1
71 atoms
C  0.57471511 -2.25720568 -0.49732363
C  -0.6347296 -1.9720365 -1.20882524
C  -0.86044664 -0.6864019 -1.726974
C  0.08944781 0.29984833 -1.48010902
C  1.25486735 0.00934369 -0.74471913
C  1.5212127 -1.2661581 -0.24161814
C  -0.62000258 -4.16123949 -0.65947965
C  -1.39299937 -3.18775469 -1.29106454
H  -1.7464617 -0.47233711 -2.31280732
H  -0.05957463 1.30085431 -1.86694285
H  1.97966717 0.79733923 -0.57443667
H  2.4269263 -1.47823602 0.30677836
N  0.5571255 -3.60465634 -0.17516627
H  -0.82760921 -5.21264827 -0.55912982
C  1.4966652 -4.25293282 0.68198242
O  2.51598388 -3.66898618 0.97503604
C  1.11802958 -5.59889047 1.24191
H  0.68229741 -6.25359539 0.48319606
H  2.05646569 -6.04952225 1.56596044
C  0.1735705 -5.46686504 2.46726874
H  0.58138936 -4.71981703 3.15570818
H  0.20502176 -6.43132016 2.98406493
C  -1.25478014 -5.14307282 2.12968309
H  -1.81295911 -5.92308875 1.61129059
C  -1.87039973 -3.99847327 2.43418169
H  -1.35492339 -3.19643098 2.95737974
H  -2.9113826 -3.83213765 2.17419832
C  -2.65958521 -3.34591787 -1.91804151
H  -2.94078104 -4.26998578 -2.40853583
N  -3.61326435 -2.38084872 -1.77936249
H  -3.51011809 -1.74091259 -0.99834215
C  -4.87464445 0.27501354 -0.29370805
C  -5.73634956 -0.77678913 -0.62076872
C  -6.52163222 -1.35083998 0.38563336
C  -6.43459761 -0.88853007 1.69394964
C  -5.55656826 0.14621412 2.01621544
C  -4.77834627 0.72937012 1.02016935
H  -4.27892228 0.74904937 -1.06962082
H  -7.20550762 -2.16475927 0.16554383
H  -7.05074899 -1.34088737 2.46359511
H  -5.48744706 0.50037232 3.03908888
H  -4.10463865 1.54525921 1.25911496
C  -5.74708176 -1.27858861 -2.04919207
H  -5.26351522 -0.53346659 -2.6867439
C  -4.9696958 -2.62052822 -2.23534317
H  -4.90849793 -2.82850446 -3.30905253
C  -5.63017264 -3.82225871 -1.56778138
C  -6.53732047 -4.60113323 -2.29115225
C  -5.34497562 -4.16644558 -0.24374122
C  -7.18707508 -5.67846455 -1.68735444
H  -6.71757375 -4.3948986 -3.34329043
C  -5.9829632 -5.24685892 0.35662087
H  -4.6235018 -3.58645327 0.32220032
C  -6.9143586 -5.99839464 -0.36042174
H  -7.88822878 -6.27517894 -2.26092297
H  -5.75244691 -5.50199501 1.38559459
H  -7.41189538 -6.84021738 0.1100596
C  -8.04094935 -0.2169134 -2.25589375
C  -7.2154253 -1.57904457 -4.11267683
C  -8.9994719 -0.13017051 -3.42886485
H  -7.39445427 0.66076766 -2.20004338
H  -8.50260856 -0.38522079 -1.28527934
C  -8.08998684 -0.43460513 -4.61758924
H  -7.66719215 -2.55142937 -4.30635805
H  -6.20459451 -1.56640584 -4.51633973
H  -9.79481728 -0.87626438 -3.33772514
H  -9.46048094 0.85675416 -3.48282823
H  -8.63448337 -0.72933536 -5.51517369
H  -7.47566946 0.43681573 -4.86031725
N  -7.14791176 -1.40382238 -2.59253105
H  -7.56891631 -2.23743566 -2.17077207
