program: Gaussian 16
title: Title Card Required
version: ES64L-G16RevC.02
basis: 6-31+G(d,p)
method: UwB97XD TD-FC
operation: Force
keyword: #p
keyword: td=(nstates=30,root=2)
keyword: uwb97xd/6-31+g(d,p)
keyword: force
keyword: scrf=(CPCM,solvent=chloroform)
keyword: nosymm
keyword: scf=xqc
keyword: Guess=mix
keyword: density=current
title: #p td=(nstates=30,root=2) uwb97xd/6-31+g(d,p) force scrf=(CPCM,solvent
basis: NPDir=0 NMtPBC= 1 NCelOv= 1 NCel= 1 NClECP= 1 NCelD= 1
basis: NCelK= 1 NCelE2= 1 NClLst= 1 CellRange= 0.0.
basis: One-electron integrals computed using PRISM.
basis: NBasis= 859 RedAO= T EigKep= 1.12D-06 NBF= 859
basis: NBsUse= 854 1.00D-06 EigRej= 8.96D-07 NBFU= 854
converged: NO NO NO NO
hfenergy: -1479.2097256 hartree
pointgroup: C01 [X(C32H35N3O1)]
dipole: -3.424717 1.5636091 -2.9955993 debye
InChI: InChI=1/32C.3N.O.35H
charge 2 multiplicity 1
71 atoms
C  0.58745214 -2.25595928 -0.51454381
C  -0.62588377 -1.97363799 -1.22000446
C  -0.85213484 -0.68339337 -1.73420892
C  0.09405923 0.30283924 -1.48761802
C  1.26152779 0.01192584 -0.75970744
C  1.53479969 -1.26962679 -0.2633767
C  -0.61138584 -4.16023383 -0.65386677
C  -1.38738559 -3.18441187 -1.28589508
H  -1.74430942 -0.46659017 -2.31377811
H  -0.06029769 1.30710647 -1.86587307
H  1.98595971 0.79993111 -0.58469859
H  2.44345745 -1.48231867 0.27676408
N  0.56814725 -3.6049571 -0.18070584
H  -0.82602337 -5.2072815 -0.54209992
C  1.49309221 -4.24366274 0.69361317
O  2.50551217 -3.6510701 1.00821216
C  1.11528393 -5.59203821 1.2458676
H  0.69047664 -6.24603863 0.48007887
H  2.05206771 -6.04014086 1.57830818
C  0.15827646 -5.46884917 2.46240169
H  0.55841139 -4.72356968 3.15733771
H  0.1862184 -6.4355021 2.97499734
C  -1.26815751 -5.14447513 2.11426324
H  -1.82325484 -5.92654104 1.59386751
C  -1.88452019 -4.00017733 2.41012357
H  -1.37254156 -3.19586845 2.93480709
H  -2.92422094 -3.83281507 2.14266493
C  -2.6658287 -3.35192218 -1.88712234
H  -2.95798837 -4.29251108 -2.33952281
N  -3.61142658 -2.38040262 -1.7751552
H  -3.49798141 -1.7016258 -1.02676667
C  -4.87794396 0.2703055 -0.28756536
C  -5.73724554 -0.78334887 -0.61320362
C  -6.51837428 -1.36149015 0.39422711
C  -6.43076963 -0.89766642 1.70250258
C  -5.55835215 0.14193024 2.02252536
C  -4.78216356 0.72679119 1.02588369
H  -4.28331779 0.74497159 -1.06387497
H  -7.19752472 -2.17948846 0.17607792
H  -7.0424602 -1.3533858 2.47391038
H  -5.49129879 0.49926611 3.04455145
H  -4.11119698 1.54509639 1.26297849
C  -5.74847929 -1.28114621 -2.04308154
H  -5.26808613 -0.53174713 -2.67815827
C  -4.96675688 -2.61910449 -2.23491448
H  -4.90241543 -2.82276426 -3.30971719
C  -5.62712191 -3.82423549 -1.57427293
C  -6.5325202 -4.60521703 -2.29838822
C  -5.34444801 -4.16515937 -0.24897386
C  -7.18599533 -5.67782933 -1.69128967
H  -6.70893971 -4.4037336 -3.3524583
C  -5.98582305 -5.24070708 0.35438033
H  -4.62204184 -3.58304583 0.3131963
C  -6.91882589 -5.99199198 -0.36125026
H  -7.88693542 -6.27723799 -2.2628565
H  -5.75746367 -5.49225445 1.38467882
H  -7.42077071 -6.82875795 0.11242749
C  -8.04192898 -0.21972906 -2.25286478
C  -7.21067936 -1.58072336 -4.10798635
C  -8.99695145 -0.13217562 -3.42878457
H  -7.39532619 0.65767038 -2.19495082
H  -8.50646691 -0.38800147 -1.28334128
C  -8.08379897 -0.43621018 -4.61473393
H  -7.65994458 -2.55376279 -4.30464309
H  -6.19844966 -1.56577904 -4.50747251
H  -9.79291037 -0.87797003 -3.34079927
H  -9.45753915 0.85490979 -3.48406849
H  -8.624998 -0.73011306 -5.51456968
H  -7.46821146 0.43511816 -4.85471855
N  -7.14840216 -1.40701689 -2.58755016
H  -7.57081324 -2.24077785 -2.16712467
