program: Gaussian 16
title: Title Card Required
version: ES64L-G16RevC.02
basis: 6-31+G(d,p)
method: UwB97XD TD-FC
operation: Force
keyword: #p
keyword: td=(nstates=30,root=2)
keyword: uwb97xd/6-31+g(d,p)
keyword: force
keyword: scrf=(CPCM,solvent=chloroform)
keyword: nosymm
keyword: scf=xqc
keyword: Guess=mix
keyword: density=current
title: #p td=(nstates=30,root=2) uwb97xd/6-31+g(d,p) force scrf=(CPCM,solvent
basis: NPDir=0 NMtPBC= 1 NCelOv= 1 NCel= 1 NClECP= 1 NCelD= 1
basis: NCelK= 1 NCelE2= 1 NClLst= 1 CellRange= 0.0.
basis: One-electron integrals computed using PRISM.
basis: NBasis= 859 RedAO= T EigKep= 1.12D-06 NBF= 859
basis: NBsUse= 854 1.00D-06 EigRej= 8.96D-07 NBFU= 854
converged: NO NO NO NO
hfenergy: -1479.2084284 hartree
pointgroup: C01 [X(C32H35N3O1)]
dipole: -3.3952488 1.5410417 -2.9771002 debye
InChI: InChI=1/32C.3N.O.35H
charge 2 multiplicity 1
71 atoms
C  0.58364921 -2.25519089 -0.50396967
C  -0.62994508 -1.96973501 -1.20953039
C  -0.85651321 -0.68380991 -1.72946105
C  0.09174476 0.30355442 -1.48254427
C  1.26111953 0.01125295 -0.75553112
C  1.53214445 -1.26649392 -0.25765435
C  -0.61508294 -4.1558941 -0.65512153
C  -1.39124272 -3.18282996 -1.28604695
H  -1.7395485 -0.4749679 -2.32126914
H  -0.05979643 1.3051539 -1.86577408
H  1.98764878 0.79876059 -0.58859063
H  2.44359984 -1.47737696 0.28302845
N  0.56527101 -3.60393718 -0.17751708
H  -0.82672632 -5.20721082 -0.55161559
C  1.49635134 -4.24672278 0.69094232
O  2.50770134 -3.65838455 1.00046137
C  1.11705693 -5.59562183 1.24507558
H  0.69091125 -6.25205655 0.48200921
H  2.05403803 -6.04401865 1.57795158
C  0.16242126 -5.46793203 2.46299615
H  0.56489489 -4.72321311 3.15695849
H  0.18953868 -6.43393543 2.97701904
C  -1.2642946 -5.14350464 2.11738435
H  -1.82058455 -5.92533107 1.59845338
C  -1.88145724 -3.99937346 2.41583396
H  -1.36939161 -3.19459216 2.93899272
H  -2.92169428 -3.8340626 2.15032869
C  -2.66001761 -3.3495283 -1.90614796
H  -2.95025772 -4.29433688 -2.35055349
N  -3.61190845 -2.37974242 -1.78985226
H  -3.51341465 -1.72995061 -1.01627576
C  -4.87845859 0.27380234 -0.28834799
C  -5.73668467 -0.78067756 -0.61516576
C  -6.51922178 -1.35750195 0.39215866
C  -6.43166455 -0.89485595 1.70088531
C  -5.5571737 0.14249045 2.0224367
C  -4.78116844 0.72790713 1.0259163
H  -4.2869857 0.75234033 -1.06481291
H  -7.20177825 -2.17244858 0.17302065
H  -7.04537584 -1.34960314 2.47113869
H  -5.48988905 0.49859308 3.04502268
H  -4.10885251 1.54488798 1.26434231
C  -5.74783039 -1.27967341 -2.0450833
H  -5.26621695 -0.53069238 -2.67996546
C  -4.97025615 -2.62044644 -2.23983679
H  -4.92010086 -2.82486425 -3.31532514
C  -5.62533629 -3.82284319 -1.5703249
C  -6.53081488 -4.60261762 -2.29429675
C  -5.34233286 -4.16534642 -0.24481086
C  -7.18388012 -5.67696624 -1.69069965
H  -6.70832962 -4.39644184 -3.34696437
C  -5.98400609 -5.24288996 0.35557223
H  -4.62225758 -3.58504074 0.32343966
C  -6.9156791 -5.99411469 -0.36176781
H  -7.88617294 -6.27147413 -2.26515919
H  -5.75911527 -5.49502056 1.38689417
H  -7.41862803 -6.83142029 0.10977728
C  -8.04112211 -0.21985358 -2.25360273
C  -7.2120878 -1.58060267 -4.10985333
C  -8.99716598 -0.13202178 -3.42859601
H  -7.3946791 0.65773496 -2.19575943
H  -8.5041185 -0.38937524 -1.28381721
C  -8.08529686 -0.43597641 -4.61562492
H  -7.66256722 -2.55335216 -4.30473661
H  -6.20081862 -1.56663746 -4.51222842
H  -9.79273168 -0.87807365 -3.33964307
H  -9.4574863 0.85515161 -3.48296089
H  -8.62744012 -0.73013906 -5.51480155
H  -7.46962132 0.43504942 -4.85635415
N  -7.14742335 -1.40597672 -2.58953048
H  -7.56773626 -2.24030735 -2.1684249
