program: Gaussian 16
title: Title Card Required
version: ES64L-G16RevC.02
basis: 6-31+G(d,p)
method: UwB97XD TD-FC
operation: Force
keyword: #p
keyword: td=(nstates=30,root=3)
keyword: uwb97xd/6-31+g(d,p)
keyword: force
keyword: scrf=(CPCM,solvent=chloroform)
keyword: nosymm
keyword: scf=xqc
keyword: Guess=mix
keyword: density=current
title: #p td=(nstates=30,root=3) uwb97xd/6-31+g(d,p) force scrf=(CPCM,solvent
basis: NPDir=0 NMtPBC= 1 NCelOv= 1 NCel= 1 NClECP= 1 NCelD= 1
basis: NCelK= 1 NCelE2= 1 NClLst= 1 CellRange= 0.0.
basis: One-electron integrals computed using PRISM.
basis: NBasis= 859 RedAO= T EigKep= 1.12D-06 NBF= 859
basis: NBsUse= 854 1.00D-06 EigRej= 8.91D-07 NBFU= 854
converged: NO NO NO NO
hfenergy: -1479.2083993 hartree
pointgroup: C01 [X(C32H35N3O1)]
dipole: -2.137372 2.0756379 -2.8396033 debye
InChI: InChI=1/32C.3N.O.35H
charge 2 multiplicity 1
71 atoms
C  0.58478757 -2.25559501 -0.50655864
C  -0.63004916 -1.96979765 -1.20966716
C  -0.8566136 -0.68371063 -1.72887366
C  0.09180811 0.30227279 -1.48244231
C  1.26245124 0.01168453 -0.75701099
C  1.53412364 -1.26718396 -0.260321
C  -0.61508627 -4.15624677 -0.65457776
C  -1.39131671 -3.18259979 -1.28504648
H  -1.73973722 -0.47460408 -2.32145905
H  -0.0595688 1.30439048 -1.86538707
H  1.9876997 0.79911155 -0.58782493
H  2.44359663 -1.47720684 0.28221207
N  0.56710317 -3.60335316 -0.17986628
H  -0.82625631 -5.20603098 -0.55009835
C  1.49671269 -4.24626439 0.69134598
O  2.50750788 -3.65689649 1.00332249
C  1.1170508 -5.59488857 1.2451057
H  0.69117718 -6.25103677 0.48171505
H  2.05360894 -6.04353419 1.57846376
C  0.16135243 -5.46770632 2.46257932
H  0.56321655 -4.72359469 3.15767419
H  0.18853651 -6.4338168 2.97640255
C  -1.26467256 -5.14528159 2.11618613
H  -1.82130377 -5.92540205 1.59759904
C  -1.88317928 -3.9982927 2.41527441
H  -1.37034738 -3.19500773 2.93764052
H  -2.9219899 -3.83391772 2.14820321
C  -2.66035999 -3.34848388 -1.90636692
H  -2.95330936 -4.29559354 -2.34572782
N  -3.61266372 -2.38056304 -1.78822628
H  -3.51244561 -1.72550015 -1.01875946
C  -4.87852599 0.27317193 -0.28802208
C  -5.7368825 -0.78127128 -0.61469006
C  -6.51892631 -1.35829002 0.39274563
C  -6.43130789 -0.89556089 1.70136602
C  -5.55730138 0.14238671 2.02271059
C  -4.78134261 0.72764329 1.02611609
H  -4.28678527 0.75124554 -1.06454655
H  -7.20101466 -2.17369754 0.17369733
H  -7.04462302 -1.35054489 2.47177635
H  -5.49045506 0.49892633 3.04518796
H  -4.109184 1.54482563 1.2642684
C  -5.74810432 -1.27986666 -2.04477939
H  -5.26671827 -0.53045229 -2.67921698
C  -4.97019867 -2.62040282 -2.23989074
H  -4.91754985 -2.82362764 -3.31557236
C  -5.6256505 -3.82315588 -1.57101887
C  -6.53087961 -4.60322512 -2.29487974
C  -5.34237307 -4.16520375 -0.24534735
C  -7.18381888 -5.67719017 -1.69076763
H  -6.70827601 -4.39781313 -3.3477733
C  -5.98403194 -5.24256761 0.35557068
H  -4.62214408 -3.58491539 0.32254847
C  -6.91589298 -5.99377843 -0.36177665
H  -7.88615345 -6.27175248 -2.26512836
H  -5.75921091 -5.49440954 1.38688913
H  -7.4195546 -6.83058724 0.11002332
C  -8.04125021 -0.21997269 -2.25343815
C  -7.21168333 -1.58067348 -4.10948261
C  -8.9970102 -0.13212753 -3.42862503
H  -7.39474315 0.65756473 -2.19557109
H  -8.50440047 -0.3893266 -1.28366275
C  -8.08482092 -0.43605356 -4.61542472
H  -7.66188777 -2.55349455 -4.30459914
H  -6.20022176 -1.56655942 -4.5113466
H  -9.79263897 -0.87816596 -3.33980863
H  -9.45725715 0.85506748 -3.48314592
H  -8.62675878 -0.73026918 -5.51470752
H  -7.46912788 0.43505082 -4.85594253
N  -7.14758034 -1.40611422 -2.58916298
H  -7.56783667 -2.24049232 -2.16799249
