program: Gaussian 16
title: Title Card Required
version: ES64L-G16RevC.02
basis: 6-31+G(d,p)
method: UwB97XD TD-FC
operation: Force
keyword: #p
keyword: td=(nstates=30,root=2)
keyword: uwb97xd/6-31+g(d,p)
keyword: force
keyword: scrf=(CPCM,solvent=chloroform)
keyword: nosymm
keyword: scf=xqc
keyword: Guess=mix
keyword: density=current
title: #p td=(nstates=30,root=2) uwb97xd/6-31+g(d,p) force scrf=(CPCM,solvent
basis: NPDir=0 NMtPBC= 1 NCelOv= 1 NCel= 1 NClECP= 1 NCelD= 1
basis: NCelK= 1 NCelE2= 1 NClLst= 1 CellRange= 0.0.
basis: One-electron integrals computed using PRISM.
basis: NBasis= 859 RedAO= T EigKep= 1.12D-06 NBF= 859
basis: NBsUse= 854 1.00D-06 EigRej= 8.98D-07 NBFU= 854
converged: NO NO NO NO
hfenergy: -1479.2096772 hartree
pointgroup: C01 [X(C32H35N3O1)]
dipole: -2.1603958 2.0766682 -2.8580962 debye
InChI: InChI=1/32C.3N.O.35H
charge 2 multiplicity 1
71 atoms
C  0.5877 -2.25794 -0.51448
C  -0.62497 -1.97252 -1.22055
C  -0.85412 -0.68416 -1.73572
C  0.0951 0.30353 -1.48829
C  1.26291 0.01138 -0.75829
C  1.53348 -1.26806 -0.26426
C  -0.61146 -4.15872 -0.65488
C  -1.38813 -3.18612 -1.28676
H  -1.74365 -0.46628 -2.31238
H  -0.06063 1.30771 -1.86603
H  1.98528 0.79953 -0.58486
H  2.44448 -1.48298 0.27686
N  0.5679 -3.6037 -0.18062
H  -0.82633 -5.20892 -0.54143
C  1.49507 -4.24224 0.69464
O  2.50331 -3.65192 1.00758
C  1.11494 -5.59183 1.24592
H  0.69039 -6.24583 0.47994
H  2.05205 -6.03992 1.57825
C  0.15803 -5.46864 2.46248
H  0.55819 -4.72357 3.15712
H  0.18613 -6.43586 2.97499
C  -1.26759 -5.14595 2.11376
H  -1.82319 -5.92633 1.59382
C  -1.88534 -3.99865 2.41017
H  -1.37276 -3.19622 2.93457
H  -2.92409 -3.83284 2.14253
C  -2.66543 -3.35355 -1.88506
H  -2.95776 -4.29173 -2.33919
N  -3.61094 -2.37866 -1.77369
H  -3.49703 -1.70072 -1.0277
C  -4.87788 0.27025 -0.28732
C  -5.73726 -0.78359 -0.61325
C  -6.51824 -1.36149 0.39437
C  -6.43091 -0.89788 1.7025
C  -5.55834 0.14195 2.02251
C  -4.78229 0.72666 1.02574
H  -4.28303 0.74463 -1.06393
H  -7.19742 -2.17992 0.17619
H  -7.04232 -1.35349 2.4740
H  -5.49131 0.49926 3.04447
H  -4.11129 1.54515 1.26289
C  -5.74849 -1.28113 -2.04287
H  -5.26812 -0.53187 -2.67818
C  -4.96672 -2.61924 -2.23481
H  -4.90167 -2.82284 -3.30913
C  -5.62727 -3.82435 -1.57432
C  -6.53253 -4.60518 -2.2987
C  -5.34469 -4.16522 -0.2494
C  -7.18633 -5.67819 -1.69102
H  -6.70899 -4.40401 -3.35279
C  -5.98624 -5.24087 0.35421
H  -4.62195 -3.58281 0.31259
C  -6.91892 -5.9917 -0.3612
H  -7.88695 -6.27759 -2.26267
H  -5.75731 -5.49209 1.38442
H  -7.42071 -6.82863 0.11255
C  -8.04201 -0.2198 -2.25264
C  -7.2108 -1.58081 -4.10786
C  -8.99698 -0.13215 -3.4288
H  -7.39534 0.65775 -2.19493
H  -8.50655 -0.38788 -1.28346
C  -8.08373 -0.4362 -4.61473
H  -7.65982 -2.5537 -4.30466
H  -6.1983 -1.56572 -4.50729
H  -9.79293 -0.87794 -3.34087
H  -9.45759 0.8549 -3.48413
H  -8.62492 -0.73008 -5.51458
H  -7.46822 0.43509 -4.85466
N  -7.14843 -1.40716 -2.58744
H  -7.57103 -2.24073 -2.16715
