program: Gaussian 16
title: Title Card Required
version: ES64L-G16RevC.02
basis: 6-31+G(d,p)
method: UwB97XD TD-FC
operation: Force
keyword: #p
keyword: td=(nstates=30,root=3)
keyword: uwb97xd/6-31+g(d,p)
keyword: force
keyword: scrf=(CPCM,solvent=chloroform)
keyword: nosymm
keyword: scf=xqc
keyword: Guess=mix
keyword: density=current
title: #p td=(nstates=30,root=3) uwb97xd/6-31+g(d,p) force scrf=(CPCM,solvent
basis: NPDir=0 NMtPBC= 1 NCelOv= 1 NCel= 1 NClECP= 1 NCelD= 1
basis: NCelK= 1 NCelE2= 1 NClLst= 1 CellRange= 0.0.
basis: One-electron integrals computed using PRISM.
basis: NBasis= 859 RedAO= T EigKep= 1.13D-06 NBF= 859
basis: NBsUse= 854 1.00D-06 EigRej= 8.90D-07 NBFU= 854
converged: NO NO NO NO
hfenergy: -1479.2107432 hartree
pointgroup: C01 [X(C32H35N3O1)]
dipole: -2.233491 2.0852105 -2.8966299 debye
InChI: InChI=1/32C.3N.O.35H
charge 2 multiplicity 1
71 atoms
C  0.58797405 -2.25434163 -0.52006025
C  -0.62924008 -1.96791451 -1.217564
C  -0.85629472 -0.67516206 -1.72879432
C  0.09405443 0.30628917 -1.47634994
C  1.27312103 0.01319909 -0.76782123
C  1.54334521 -1.27236795 -0.28328789
C  -0.6112372 -4.15416769 -0.65272547
C  -1.39205693 -3.1804006 -1.28777695
H  -1.73521261 -0.45172122 -2.32035228
H  -0.06564662 1.31570244 -1.83967794
H  1.99516581 0.79890343 -0.59105922
H  2.45571674 -1.48765301 0.2553906
N  0.57055364 -3.6031401 -0.18543365
H  -0.81761609 -5.20543335 -0.55662269
C  1.49186351 -4.2368982 0.69945519
O  2.49262022 -3.64345404 1.02762087
C  1.11470907 -5.59113598 1.24984399
H  0.69750389 -6.24885295 0.48365967
H  2.05170436 -6.0346679 1.58848688
C  0.15360419 -5.47055552 2.46385252
H  0.55163378 -4.72871981 3.16379032
H  0.17773177 -6.43676983 2.97698309
C  -1.27078043 -5.14631068 2.11092905
H  -1.82426262 -5.92726999 1.58784311
C  -1.88832384 -4.00098535 2.40500605
H  -1.37695017 -3.1955656 2.92779933
H  -2.92615283 -3.83473471 2.13178474
C  -2.66311006 -3.36055961 -1.89994556
H  -2.96376509 -4.32578454 -2.29265781
N  -3.61389269 -2.39287409 -1.80511043
H  -3.46962734 -1.64680114 -1.13114366
C  -4.88049437 0.27113078 -0.2804234
C  -5.73588867 -0.78745542 -0.6045276
C  -6.51644617 -1.36248919 0.40413698
C  -6.43018546 -0.89666232 1.71196817
C  -5.5562527 0.14279482 2.03118385
C  -4.78354598 0.72838639 1.03345487
H  -4.29358196 0.752601 -1.05803961
H  -7.19711811 -2.17990523 0.18637788
H  -7.04462259 -1.34847766 2.48275267
H  -5.48795362 0.49939228 3.05398405
H  -4.11530372 1.54965241 1.26905369
C  -5.74924641 -1.28416188 -2.03567609
H  -5.26796726 -0.53368113 -2.66811888
C  -4.9758209 -2.6254096 -2.24262496
H  -4.93570727 -2.82738596 -3.31962063
C  -5.62826224 -3.82733642 -1.57116263
C  -6.53145164 -4.60675699 -2.29699598
C  -5.34657924 -4.16746211 -0.24443218
C  -7.18804927 -5.67822412 -1.69476807
H  -6.70147107 -4.3995267 -3.35108657
C  -5.99055127 -5.24446972 0.35497059
H  -4.62597526 -3.58479583 0.32003635
C  -6.92236947 -5.99448895 -0.36452177
H  -7.89230474 -6.27005232 -2.27033125
H  -5.76878354 -5.49633056 1.38736481
H  -7.42903239 -6.82992185 0.10677695
C  -8.04180009 -0.22147076 -2.25062282
C  -7.20481631 -1.58400394 -4.10265242
C  -8.99257128 -0.13519565 -3.43062148
H  -7.39518656 0.65592053 -2.19040978
H  -8.50939716 -0.39031232 -1.28317688
C  -8.07589637 -0.44069179 -4.61344821
H  -7.65146999 -2.55796048 -4.29908345
H  -6.19129269 -1.56754442 -4.49985605
H  -9.78786312 -0.88183166 -3.34414764
H  -9.45334712 0.85139646 -3.48869494
H  -8.61405604 -0.73681734 -5.5142516
H  -7.45887179 0.42969733 -4.85314012
N  -7.14759257 -1.40838569 -2.58213271
H  -7.57030594 -2.24196606 -2.16148534
