program: Gaussian 16
title: Title Card Required
version: ES64L-G16RevC.02
basis: 6-31+G(d,p)
method: UwB97XD TD-FC
operation: Force
keyword: #p
keyword: td=(nstates=30,root=3)
keyword: uwb97xd/6-31+g(d,p)
keyword: force
keyword: scrf=(CPCM,solvent=chloroform)
keyword: nosymm
keyword: scf=xqc
keyword: Guess=mix
keyword: density=current
title: #p td=(nstates=30,root=3) uwb97xd/6-31+g(d,p) force scrf=(CPCM,solvent
basis: NPDir=0 NMtPBC= 1 NCelOv= 1 NCel= 1 NClECP= 1 NCelD= 1
basis: NCelK= 1 NCelE2= 1 NClLst= 1 CellRange= 0.0.
basis: One-electron integrals computed using PRISM.
basis: NBasis= 859 RedAO= T EigKep= 1.14D-06 NBF= 859
basis: NBsUse= 854 1.00D-06 EigRej= 9.02D-07 NBFU= 854
converged: NO NO NO NO
hfenergy: -1479.2112905 hartree
pointgroup: C01 [X(C32H35N3O1)]
dipole: -3.4381197 1.6090075 -3.020882 debye
InChI: InChI=1/32C.3N.O.35H
charge 2 multiplicity 1
71 atoms
C  0.5883616 -2.25372526 -0.51558948
C  -0.62613299 -1.96521335 -1.21730802
C  -0.85300411 -0.66975284 -1.72427175
C  0.09199058 0.31703809 -1.46698489
C  1.26968745 0.01591648 -0.76245496
C  1.54277264 -1.27292014 -0.28128123
C  -0.60652362 -4.15397891 -0.65916072
C  -1.38668503 -3.17617495 -1.29563897
H  -1.72942917 -0.45411671 -2.3234786
H  -0.06759556 1.32654147 -1.82990129
H  2.00513715 0.79454214 -0.60349254
H  2.46583437 -1.49265443 0.23599078
N  0.57130625 -3.60574541 -0.18355798
H  -0.81919444 -5.20602684 -0.56587082
C  1.48838707 -4.23649751 0.70288083
O  2.48699967 -3.63868492 1.03633425
C  1.11531164 -5.59043558 1.25283772
H  0.69926987 -6.25206567 0.48886094
H  2.05408333 -6.02984922 1.59376095
C  0.15231223 -5.47117234 2.46455483
H  0.54905453 -4.72970379 3.16550077
H  0.175829 -6.43962254 2.9742082
C  -1.27087268 -5.14708139 2.1083674
H  -1.82451656 -5.92811928 1.58738445
C  -1.89027951 -3.9994503 2.40112137
H  -1.38069846 -3.19553234 2.92624885
H  -2.92768389 -3.83450963 2.12805597
C  -2.66126333 -3.36390764 -1.89807681
H  -2.96316867 -4.33825819 -2.26190471
N  -3.60570306 -2.38620809 -1.84743435
H  -3.46046315 -1.63315309 -1.18318982
C  -4.88259321 0.27264145 -0.27604108
C  -5.73393766 -0.78928234 -0.6003548
C  -6.51599707 -1.36258671 0.40962313
C  -6.42990589 -0.89529706 1.71706387
C  -5.55503036 0.142974 2.03686785
C  -4.78395923 0.72921121 1.03786064
H  -4.30206851 0.76200514 -1.05402982
H  -7.20046284 -2.17719349 0.19378747
H  -7.04609716 -1.34486484 2.48821943
H  -5.48645195 0.50018856 3.0592447
H  -4.11623901 1.55120252 1.27313491
C  -5.74809839 -1.28489543 -2.03255428
H  -5.26736648 -0.53294544 -2.66401371
C  -4.97894697 -2.62738917 -2.25098507
H  -4.975223 -2.83426766 -3.32702941
C  -5.62331905 -3.82862168 -1.56931337
C  -6.52905537 -4.60646701 -2.29542152
C  -5.34682102 -4.16959334 -0.24150952
C  -7.18986726 -5.67717351 -1.69557554
H  -6.70236005 -4.39830889 -3.34861223
C  -5.99502411 -5.24707065 0.35467802
H  -4.63072788 -3.58779565 0.33035099
C  -6.92612729 -5.99568875 -0.36643973
H  -7.8941468 -6.26636144 -2.27346273
H  -5.77801708 -5.50155616 1.38697615
H  -7.43275779 -6.83247836 0.10183574
C  -8.04090481 -0.22272726 -2.24971954
C  -7.2012616 -1.58603863 -4.09998349
C  -8.98968478 -0.13723567 -3.43133909
H  -7.39501982 0.65500319 -2.18783136
H  -8.51018119 -0.39232898 -1.28301388
C  -8.07153905 -0.4435817 -4.61279318
H  -7.64747636 -2.56039358 -4.29591808
H  -6.18757669 -1.56944655 -4.49632572
H  -9.78490055 -0.88408669 -3.34584269
H  -9.45046555 0.84919189 -3.49094564
H  -8.60801206 -0.74087972 -5.51422252
H  -7.4537429 0.42612404 -4.85255039
N  -7.14593535 -1.40904758 -2.57961148
H  -7.56812106 -2.2427659 -2.15864342
