program: Gaussian 16
title: Title Card Required
version: ES64L-G16RevC.02
basis: 6-31+G(d,p)
method: UwB97XD TD-FC
operation: Force
keyword: #p
keyword: td=(nstates=30,root=2)
keyword: uwb97xd/6-31+g(d,p)
keyword: force
keyword: scrf=(CPCM,solvent=chloroform)
keyword: nosymm
keyword: scf=xqc
keyword: Guess=mix
keyword: density=current
title: #p td=(nstates=30,root=2) uwb97xd/6-31+g(d,p) force scrf=(CPCM,solvent
basis: NPDir=0 NMtPBC= 1 NCelOv= 1 NCel= 1 NClECP= 1 NCelD= 1
basis: NCelK= 1 NCelE2= 1 NClLst= 1 CellRange= 0.0.
basis: One-electron integrals computed using PRISM.
basis: NBasis= 859 RedAO= T EigKep= 1.14D-06 NBF= 859
basis: NBsUse= 854 1.00D-06 EigRej= 9.05D-07 NBFU= 854
converged: NO NO NO NO
hfenergy: -1479.2108538 hartree
pointgroup: C01 [X(C32H35N3O1)]
dipole: -2.2776612 2.0239835 -2.8948258 debye
InChI: InChI=1/32C.3N.O.35H
charge 2 multiplicity 1
71 atoms
C  0.58799185 -2.25403306 -0.51504893
C  -0.62498472 -1.96569494 -1.21704544
C  -0.85254435 -0.66847129 -1.72464391
C  0.09140199 0.31741188 -1.46590673
C  1.26911541 0.01707926 -0.76217752
C  1.54318036 -1.27341815 -0.2804548
C  -0.60593166 -4.15545604 -0.65966755
C  -1.38627654 -3.17537065 -1.29612162
H  -1.72876932 -0.45446489 -2.32332415
H  -0.0677201 1.32796606 -1.82952114
H  2.00568042 0.79372055 -0.60464868
H  2.46639206 -1.49313938 0.23421835
N  0.57118192 -3.60504382 -0.18368227
H  -0.81934875 -5.2052394 -0.56663734
C  1.48557171 -4.23863079 0.70275981
O  2.48869831 -3.63683249 1.03748302
C  1.11554784 -5.59025288 1.25319632
H  0.69938686 -6.25225741 0.48924002
H  2.05423704 -6.02942407 1.59408643
C  0.15213522 -5.47115838 2.46465519
H  0.54893452 -4.72964435 3.16559141
H  0.17576613 -6.43993975 2.97384872
C  -1.27060619 -5.1477268 2.10795136
H  -1.82450385 -5.92813687 1.58743928
C  -1.89072868 -3.99867671 2.40088085
H  -1.38102744 -3.19560118 2.92616514
H  -2.92773684 -3.83451543 2.12785509
C  -2.66048072 -3.36524279 -1.8976937
H  -2.96309379 -4.338861 -2.25958921
N  -3.60532187 -2.38425747 -1.85056568
H  -3.45993551 -1.63281509 -1.1873564
C  -4.88290123 0.27262055 -0.27544745
C  -5.73356904 -0.78919205 -0.60024369
C  -6.5161226 -1.36264367 0.41048838
C  -6.42965324 -0.89508453 1.71699223
C  -5.55530974 0.14272906 2.03768254
C  -4.78365596 0.72950731 1.03774747
H  -4.30270742 0.7628177 -1.0537528
H  -7.20074574 -2.17693206 0.19437777
H  -7.04629278 -1.34464104 2.48877145
H  -5.4863214 0.50024111 3.05951329
H  -4.11639768 1.55117687 1.27342623
C  -5.74793344 -1.28497985 -2.03223588
H  -5.26731581 -0.53278044 -2.6638123
C  -4.97902875 -2.62764411 -2.2515894
H  -4.97854783 -2.83486239 -3.32746315
C  -5.62285067 -3.82887025 -1.56893192
C  -6.52875756 -4.60622222 -2.2955342
C  -5.34663104 -4.16935498 -0.24161886
C  -7.18999623 -5.67715665 -1.69527228
H  -6.70255118 -4.39832324 -3.34830846
C  -5.99552925 -5.24754672 0.35494671
H  -4.63122327 -3.58811847 0.3311111
C  -6.92643085 -5.99547664 -0.36712153
H  -7.89429228 -6.26618389 -2.27364785
H  -5.77875401 -5.50193514 1.38673331
H  -7.43313543 -6.83294837 0.10164182
C  -8.04083421 -0.22284962 -2.2496099
C  -7.20104508 -1.58621895 -4.09978918
C  -8.98949434 -0.13739078 -3.43142098
H  -7.39500596 0.6549323 -2.18764216
H  -8.51023245 -0.39247582 -1.28301101
C  -8.07122217 -0.44380202 -4.61273756
H  -7.64718345 -2.56057744 -4.29569653
H  -6.18729446 -1.56959716 -4.49605281
H  -9.78467336 -0.88426624 -3.34596569
H  -9.45025139 0.84905252 -3.49111566
H  -8.607558 -0.74118602 -5.51422607
H  -7.45335727 0.42585665 -4.85251525
N  -7.14575724 -1.40911008 -2.57941424
H  -7.5679475 -2.2427859 -2.15847142
