program: Gaussian 16
title: Title Card Required
version: ES64L-G16RevC.02
basis: 6-31+G(d,p)
method: UwB97XD TD-FC
operation: Force
keyword: #p
keyword: td=(nstates=30,root=3)
keyword: uwb97xd/6-31+g(d,p)
keyword: force
keyword: scrf=(CPCM,solvent=chloroform)
keyword: nosymm
keyword: scf=xqc
keyword: Guess=mix
keyword: density=current
title: #p td=(nstates=30,root=3) uwb97xd/6-31+g(d,p) force scrf=(CPCM,solvent
basis: NPDir=0 NMtPBC= 1 NCelOv= 1 NCel= 1 NClECP= 1 NCelD= 1
basis: NCelK= 1 NCelE2= 1 NClLst= 1 CellRange= 0.0.
basis: One-electron integrals computed using PRISM.
basis: NBasis= 859 RedAO= T EigKep= 1.13D-06 NBF= 859
basis: NBsUse= 854 1.00D-06 EigRej= 9.00D-07 NBFU= 854
converged: NO NO NO NO
hfenergy: -1479.2118019 hartree
pointgroup: C01 [X(C32H35N3O1)]
dipole: -2.34916 2.0175226 -2.9051353 debye
InChI: InChI=1/32C.3N.O.35H
charge 2 multiplicity 1
71 atoms
C  0.58977181 -2.25155843 -0.51475587
C  -0.62606644 -1.96436751 -1.21770407
C  -0.85108086 -0.66951114 -1.72273935
C  0.09117092 0.32138574 -1.46681447
C  1.26800791 0.01395965 -0.76038376
C  1.5409993 -1.27323509 -0.28119494
C  -0.60552257 -4.15036223 -0.66102575
C  -1.38296143 -3.17808979 -1.29581083
H  -1.72897193 -0.45468912 -2.32412433
H  -0.06781836 1.32738654 -1.82810578
H  2.0075755 0.79467901 -0.6058174
H  2.46798409 -1.49366689 0.23284146
N  0.5694321 -3.6078181 -0.1836724
H  -0.81981837 -5.20759762 -0.56716152
C  1.48553124 -4.23872753 0.70326668
O  2.48883299 -3.6362408 1.03848112
C  1.11560037 -5.59003345 1.25326621
H  0.69944114 -6.25263536 0.48971418
H  2.05436236 -6.02891238 1.59448672
C  0.15197305 -5.47078147 2.46470982
H  0.54867139 -4.72985687 3.16559614
H  0.17556437 -6.44033563 2.97367031
C  -1.26949713 -5.15032443 2.1070698
H  -1.8243319 -5.9277844 1.58767797
C  -1.89214122 -3.996147 2.40116129
H  -1.38151492 -3.19597768 2.92585074
H  -2.92751163 -3.83456767 2.12764434
C  -2.66363299 -3.35991434 -1.89668682
H  -2.96319303 -4.34123925 -2.25749406
N  -3.60266794 -2.388865 -1.85670109
H  -3.4589294 -1.63037604 -1.19004877
C  -4.88185097 0.27385971 -0.27669684
C  -5.7351039 -0.79090316 -0.59837856
C  -6.51480382 -1.36203233 0.40803723
C  -6.43111413 -0.89584816 1.7198286
C  -5.55307292 0.14433097 2.03561866
C  -4.78564021 0.7280981 1.04076487
H  -4.30381187 0.76329317 -1.05291116
H  -7.20123543 -2.17683683 0.1951513
H  -7.04588702 -1.34397124 2.48855588
H  -5.48629908 0.50042316 3.06061157
H  -4.11597318 1.55184211 1.27377062
C  -5.74785969 -1.28538283 -2.03247842
H  -5.26722802 -0.53271418 -2.66353468
C  -4.97881877 -2.62656133 -2.25105353
H  -4.98201034 -2.83567014 -3.32863119
C  -5.62237348 -3.82847814 -1.57013434
C  -6.5291043 -4.60741451 -2.29398907
C  -5.34759245 -4.17156364 -0.23957079
C  -7.19009074 -5.67589117 -1.69771343
H  -6.70272364 -4.39807264 -3.34865378
C  -5.99517592 -5.24589191 0.35290736
H  -4.63139269 -3.58811411 0.332079
C  -6.92701534 -5.99711879 -0.36455329
H  -7.89429036 -6.26580735 -2.27370208
H  -5.7795096 -5.50266497 1.38730136
H  -7.43297512 -6.83233615 0.1005713
C  -8.04077105 -0.22293307 -2.24977783
C  -7.20053736 -1.58636214 -4.09962044
C  -8.98923293 -0.1375694 -3.43140507
H  -7.39498884 0.65488245 -2.18741484
H  -8.51033659 -0.39266992 -1.28289019
C  -8.07091089 -0.44402882 -4.61262754
H  -7.64687587 -2.56077064 -4.29542164
H  -6.18710926 -1.56977207 -4.49572742
H  -9.78441331 -0.88442375 -3.34611817
H  -9.45001211 0.84885289 -3.4913028
H  -8.60706955 -0.74152495 -5.51425397
H  -7.45293153 0.42554798 -4.8524719
N  -7.14569868 -1.40913826 -2.57903207
H  -7.56771745 -2.24280964 -2.15825833
