program: Gaussian 16
title: Title Card Required
version: ES64L-G16RevC.02
basis: 6-31+G(d,p)
method: UwB97XD TD-FC
operation: Force
keyword: #p
keyword: td=(nstates=30,root=3)
keyword: uwb97xd/6-31+g(d,p)
keyword: force
keyword: scrf=(CPCM,solvent=chloroform)
keyword: nosymm
keyword: scf=xqc
keyword: Guess=mix
keyword: density=current
title: #p td=(nstates=30,root=3) uwb97xd/6-31+g(d,p) force scrf=(CPCM,solvent
basis: NPDir=0 NMtPBC= 1 NCelOv= 1 NCel= 1 NClECP= 1 NCelD= 1
basis: NCelK= 1 NCelE2= 1 NClLst= 1 CellRange= 0.0.
basis: One-electron integrals computed using PRISM.
basis: NBasis= 859 RedAO= T EigKep= 1.13D-06 NBF= 859
basis: NBsUse= 854 1.00D-06 EigRej= 9.11D-07 NBFU= 854
converged: NO NO NO NO
hfenergy: -1479.2109146 hartree
pointgroup: C01 [X(C32H35N3O1)]
dipole: -3.4255902 1.6053691 -3.0159202 debye
InChI: InChI=1/32C.3N.O.35H
charge 2 multiplicity 1
71 atoms
C  0.5879013 -2.25589873 -0.51274989
C  -0.62341315 -1.96364066 -1.21815163
C  -0.85105059 -0.66972876 -1.72479967
C  0.09029853 0.32081904 -1.46356681
C  1.26815196 0.01684739 -0.76007049
C  1.54337156 -1.27141626 -0.2794071
C  -0.60506089 -4.15588625 -0.66285416
C  -1.38644616 -3.17550761 -1.29742221
H  -1.72757399 -0.45516297 -2.32280375
H  -0.06789628 1.33130012 -1.82885264
H  2.00705585 0.79193427 -0.60756565
H  2.46830224 -1.49477277 0.23030886
N  0.57224357 -3.60425739 -0.18222156
H  -0.82016717 -5.20540112 -0.56816618
C  1.4868722 -4.23724768 0.70436013
O  2.48444209 -3.6373598 1.03719705
C  1.1152378 -5.5905339 1.25412545
H  0.69968981 -6.25264014 0.49023509
H  2.0549466 -6.02837631 1.59481242
C  0.15202618 -5.47140564 2.46507569
H  0.54869439 -4.72928873 3.16571621
H  0.17582565 -6.44076843 2.97276391
C  -1.27151301 -5.14580229 2.10795763
H  -1.82473064 -5.9287334 1.58729681
C  -1.88997499 -4.00001985 2.39941213
H  -1.38163025 -3.19534077 2.92632456
H  -2.92840944 -3.83436865 2.12737579
C  -2.65868857 -3.3664187 -1.89519255
H  -2.96304404 -4.34022755 -2.25431472
N  -3.60287881 -2.38201781 -1.8596672
H  -3.45878474 -1.63156785 -1.19598863
C  -4.88346229 0.27263701 -0.27442668
C  -5.73298229 -0.78915574 -0.59984363
C  -6.51622286 -1.36277639 0.41174076
C  -6.42938164 -0.89472727 1.71763494
C  -5.55549785 0.14255833 2.03890178
C  -4.78352113 0.72971439 1.03817601
H  -4.30429301 0.7646771 -1.05299445
H  -7.20142978 -2.17625098 0.19584491
H  -7.04655851 -1.34398986 2.4898183
H  -5.48605 0.50033976 3.06012523
H  -4.1166051 1.55125358 1.27408967
C  -5.74736418 -1.28489814 -2.03159719
H  -5.26734965 -0.53260585 -2.66329188
C  -4.97872076 -2.62780004 -2.2531323
H  -4.98658126 -2.83628792 -3.32786062
C  -5.62133781 -3.82891787 -1.56848004
C  -6.52815987 -4.60591899 -2.29537662
C  -5.34674317 -4.16977991 -0.24124424
C  -7.1905153 -5.67712065 -1.69491145
H  -6.70318329 -4.39831821 -3.34803637
C  -5.99684786 -5.24839693 0.35484366
H  -4.63215042 -3.58858082 0.33292654
C  -6.9273246 -5.99565631 -0.36760306
H  -7.89450584 -6.26579765 -2.27391517
H  -5.78046982 -5.50281308 1.38601516
H  -7.43357841 -6.83341214 0.10079036
C  -8.04074356 -0.22302948 -2.249454
C  -7.20049382 -1.58659488 -4.09929121
C  -8.98905078 -0.13770253 -3.43150988
H  -7.39499705 0.65470887 -2.1872123
H  -8.51037223 -0.39281297 -1.28294713
C  -8.07050726 -0.44429231 -4.61263381
H  -7.6465499 -2.56104843 -4.29521636
H  -6.18672558 -1.56995347 -4.49537324
H  -9.78416524 -0.88470732 -3.34625215
H  -9.44975556 0.84874661 -3.49150911
H  -8.60652206 -0.74188727 -5.51425252
H  -7.4524864 0.42522847 -4.85243899
N  -7.14527885 -1.40924388 -2.5791102
H  -7.56761206 -2.24284764 -2.15808966
