program: Gaussian 16
title: Title Card Required
version: ES64L-G16RevC.02
basis: 6-31+G(d,p)
method: UwB97XD TD-FC
operation: Force
keyword: #p
keyword: td=(nstates=30,root=3)
keyword: uwb97xd/6-31+g(d,p)
keyword: force
keyword: scrf=(CPCM,solvent=chloroform)
keyword: nosymm
keyword: scf=xqc
keyword: Guess=mix
keyword: density=current
title: #p td=(nstates=30,root=3) uwb97xd/6-31+g(d,p) force scrf=(CPCM,solvent
basis: NPDir=0 NMtPBC= 1 NCelOv= 1 NCel= 1 NClECP= 1 NCelD= 1
basis: NCelK= 1 NCelE2= 1 NClLst= 1 CellRange= 0.0.
basis: One-electron integrals computed using PRISM.
basis: NBasis= 859 RedAO= T EigKep= 1.13D-06 NBF= 859
basis: NBsUse= 854 1.00D-06 EigRej= 8.95D-07 NBFU= 854
converged: NO NO NO NO
hfenergy: -1479.2102954 hartree
pointgroup: C01 [X(C32H35N3O1)]
dipole: -3.4151801 1.5694209 -2.9900482 debye
InChI: InChI=1/32C.3N.O.35H
charge 2 multiplicity 1
71 atoms
C  0.58867436 -2.25499651 -0.51983402
C  -0.62945538 -1.97006742 -1.21931865
C  -0.8543661 -0.67934159 -1.73178476
C  0.09475831 0.30578087 -1.48131366
C  1.26939996 0.01042013 -0.767713
C  1.54347896 -1.27193118 -0.2792255
C  -0.61299892 -4.15553449 -0.65290209
C  -1.39183392 -3.18258278 -1.2846915
H  -1.73891199 -0.45273003 -2.31733212
H  -0.06439203 1.31203543 -1.84727327
H  1.99097333 0.80032635 -0.58691978
H  2.45025419 -1.48619714 0.26331882
N  0.56993675 -3.60133623 -0.1845109
H  -0.81875482 -5.20588946 -0.5512274
C  1.49140392 -4.24011265 0.69855613
O  2.4962378 -3.64496521 1.02126562
C  1.11436402 -5.59046934 1.24873619
H  0.69576311 -6.24743683 0.4811764
H  2.05123402 -6.03671675 1.58514941
C  0.15459551 -5.46972481 2.46374987
H  0.5535011 -4.72719115 3.16194097
H  0.17978878 -6.43653939 2.9771563
C  -1.26986488 -5.14712539 2.1115461
H  -1.82400239 -5.92683663 1.58898448
C  -1.887835 -3.99965186 2.40669328
H  -1.37532206 -3.19589083 2.92940965
H  -2.92539731 -3.83457655 2.13469165
C  -2.66349806 -3.3590281 -1.89514415
H  -2.96321896 -4.31618605 -2.30943973
N  -3.61514569 -2.39115182 -1.78781795
H  -3.47637018 -1.66028484 -1.10094008
C  -4.87952425 0.27039963 -0.28252825
C  -5.73646624 -0.7861138 -0.60723527
C  -6.5169922 -1.36252355 0.40104677
C  -6.43020801 -0.89719964 1.70880222
C  -5.55724001 0.14251437 2.02843502
C  -4.78324087 0.72770116 1.03056929
H  -4.28941166 0.74847762 -1.0600537
H  -7.19611622 -2.18073466 0.18286854
H  -7.04383589 -1.35040186 2.48002369
H  -5.488894 0.4990681 3.05060593
H  -4.11444939 1.54846977 1.26681478
C  -5.74916049 -1.28391357 -2.03758248
H  -5.26820589 -0.53328384 -2.67128702
C  -4.97241826 -2.62373803 -2.2378426
H  -4.91898215 -2.82477638 -3.31452542
C  -5.62909581 -3.82642616 -1.57232344
C  -6.53217057 -4.60620103 -2.29822467
C  -5.34651003 -4.16651138 -0.24657445
C  -7.18765315 -5.67888019 -1.69348505
H  -6.70268116 -4.40091808 -3.35218753
C  -5.98899838 -5.24322552 0.35471642
H  -4.62396415 -3.58341895 0.31541965
C  -6.92111914 -5.99371719 -0.36356623
H  -7.89082667 -6.27269571 -2.26782873
H  -5.76426039 -5.49402123 1.38640027
H  -7.4264805 -6.82896708 0.10928289
C  -8.04206229 -0.22080731 -2.25153446
C  -7.20655208 -1.58287124 -4.1042436
C  -8.99411655 -0.13409641 -3.43000436
H  -7.39533328 0.65641679 -2.19185871
H  -8.50892602 -0.38929725 -1.28304232
C  -8.07845809 -0.43907946 -4.61375777
H  -7.65397238 -2.55668951 -4.30097415
H  -6.1937252 -1.56668102 -4.50179088
H  -9.78955138 -0.88061454 -3.34319232
H  -9.4549418 0.85274357 -3.48739703
H  -8.61750297 -0.73456089 -5.51439409
H  -7.46183852 0.43155617 -4.85354689
N  -7.14817294 -1.4080167 -2.58356917
H  -7.57123742 -2.24138276 -2.16335127
