program: Gaussian 16
title: Title Card Required
version: ES64L-G16RevC.02
basis: 6-31+G(d,p)
method: UwB97XD TD-FC
operation: Force
keyword: #p
keyword: td=(nstates=30,root=2)
keyword: uwb97xd/6-31+g(d,p)
keyword: force
keyword: scrf=(CPCM,solvent=chloroform)
keyword: nosymm
keyword: scf=xqc
keyword: Guess=mix
keyword: density=current
title: #p td=(nstates=30,root=2) uwb97xd/6-31+g(d,p) force scrf=(CPCM,solvent
basis: NPDir=0 NMtPBC= 1 NCelOv= 1 NCel= 1 NClECP= 1 NCelD= 1
basis: NCelK= 1 NCelE2= 1 NClLst= 1 CellRange= 0.0.
basis: One-electron integrals computed using PRISM.
basis: NBasis= 859 RedAO= T EigKep= 1.13D-06 NBF= 859
basis: NBsUse= 854 1.00D-06 EigRej= 8.91D-07 NBFU= 854
converged: NO NO NO NO
hfenergy: -1479.2102674 hartree
pointgroup: C01 [X(C32H35N3O1)]
dipole: -3.4315059 1.5650276 -2.9925946 debye
InChI: InChI=1/32C.3N.O.35H
charge 2 multiplicity 1
71 atoms
C  0.58820967 -2.25512383 -0.52055101
C  -0.63080834 -1.96888404 -1.21886893
C  -0.85604061 -0.67883286 -1.73020416
C  0.09527549 0.30577462 -1.47958175
C  1.27165022 0.01057686 -0.76856389
C  1.54379664 -1.27117341 -0.28220398
C  -0.61224074 -4.15383021 -0.65189796
C  -1.39272104 -3.18088346 -1.28554053
H  -1.73765957 -0.45159267 -2.31891353
H  -0.06489816 1.31245621 -1.84383178
H  1.99241174 0.80043439 -0.58763419
H  2.45219588 -1.48646693 0.26119781
N  0.57098455 -3.60288764 -0.18460709
H  -0.81790043 -5.20625449 -0.55317213
C  1.49184301 -4.23768712 0.6981455
O  2.49469985 -3.64477239 1.02397673
C  1.1141405 -5.59080013 1.24907918
H  0.69659836 -6.24789684 0.48189619
H  2.05141282 -6.03628131 1.58656522
C  0.15409527 -5.47008902 2.4636164
H  0.55274559 -4.72797667 3.1628936
H  0.17873565 -6.43629061 2.9774717
C  -1.26971284 -5.14823902 2.11102343
H  -1.82399946 -5.92673259 1.58847308
C  -1.88875027 -3.99896457 2.40666518
H  -1.37591861 -3.19597468 2.92845435
H  -2.92534852 -3.83481124 2.13346056
C  -2.66371719 -3.3606183 -1.89886804
H  -2.9634913 -4.31986837 -2.30320429
N  -3.61528293 -2.39251414 -1.79178353
H  -3.47351291 -1.65396991 -1.11261978
C  -4.88019983 0.27032042 -0.28138427
C  -5.73585279 -0.78621823 -0.60662943
C  -6.51716437 -1.36282642 0.40274237
C  -6.42994305 -0.89684451 1.70970331
C  -5.55718677 0.14239392 2.02989027
C  -4.78309182 0.72815107 1.03110162
H  -4.2906565 0.74977499 -1.05954406
H  -7.19614163 -2.18051351 0.18398671
H  -7.04420277 -1.34979073 2.48105347
H  -5.4885118 0.49911272 3.05178256
H  -4.11487029 1.54898524 1.26765967
C  -5.74932964 -1.28372757 -2.03670212
H  -5.26821247 -0.53374324 -2.66980312
C  -4.97436974 -2.62486913 -2.24038041
H  -4.923671 -2.82532557 -3.31619613
C  -5.62914547 -3.82676945 -1.57146919
C  -6.5318927 -4.60614427 -2.29821537
C  -5.34657673 -4.16664351 -0.24609413
C  -7.18792373 -5.6792434 -1.69360691
H  -6.70176037 -4.40025418 -3.35172934
C  -5.98947785 -5.24397674 0.35522754
H  -4.62443974 -3.5837652 0.31683895
C  -6.92131094 -5.99382835 -0.36417833
H  -7.89143077 -6.27150852 -2.26894241
H  -5.76576047 -5.49464793 1.38692038
H  -7.42753079 -6.82917151 0.10843174
C  -8.04198574 -0.22096835 -2.25114254
C  -7.20593515 -1.58321745 -4.1036081
C  -8.9935413 -0.13448294 -3.43025313
H  -7.39529472 0.65620227 -2.19132406
H  -8.50913814 -0.38964446 -1.2831066
C  -8.07747951 -0.43966399 -4.61368443
H  -7.65300026 -2.55718004 -4.30025581
H  -6.19277034 -1.56694549 -4.50106951
H  -9.78894219 -0.88106555 -3.34355067
H  -9.4543664 0.85222634 -3.48788826
H  -8.61621397 -0.73538151 -5.51430309
H  -7.4607306 0.43089548 -4.85336945
N  -7.14802379 -1.40820624 -2.5831405
H  -7.57101613 -2.24167012 -2.16256963
