program: Gaussian 16
title: Title Card Required
version: ES64L-G16RevC.02
basis: 6-31+G(d,p)
method: UwB97XD TD-FC
operation: Force
keyword: #p
keyword: td=(nstates=30,root=2)
keyword: uwb97xd/6-31+g(d,p)
keyword: force
keyword: scrf=(CPCM,solvent=chloroform)
keyword: nosymm
keyword: scf=xqc
keyword: Guess=mix
keyword: density=current
title: #p td=(nstates=30,root=2) uwb97xd/6-31+g(d,p) force scrf=(CPCM,solvent
basis: NPDir=0 NMtPBC= 1 NCelOv= 1 NCel= 1 NClECP= 1 NCelD= 1
basis: NCelK= 1 NCelE2= 1 NClLst= 1 CellRange= 0.0.
basis: One-electron integrals computed using PRISM.
basis: NBasis= 859 RedAO= T EigKep= 1.13D-06 NBF= 859
basis: NBsUse= 854 1.00D-06 EigRej= 8.97D-07 NBFU= 854
converged: NO NO NO NO
hfenergy: -1479.2120238 hartree
pointgroup: C01 [X(C32H35N3O1)]
dipole: -3.3835889 1.6606168 -3.0900924 debye
InChI: InChI=1/32C.3N.O.35H
charge 2 multiplicity 1
71 atoms
C  0.59154342 -2.25287848 -0.51450923
C  -0.62561252 -1.96636779 -1.20827347
C  -0.86262406 -0.66440789 -1.70079526
C  0.08389365 0.31514768 -1.45281807
C  1.27230294 0.0166148 -0.76496408
C  1.54763234 -1.27883251 -0.28678625
C  -0.59871005 -4.15968936 -0.67411796
C  -1.37601786 -3.18021646 -1.31061618
H  -1.73058656 -0.4487297 -2.30979297
H  -0.07913021 1.31853323 -1.82516395
H  2.00969129 0.79427549 -0.62182104
H  2.47624279 -1.48714477 0.22387789
N  0.5722253 -3.61036484 -0.19268352
H  -0.81921819 -5.20850042 -0.56516793
C  1.48686738 -4.23536348 0.70492109
O  2.47875595 -3.6289692 1.04394549
C  1.11485533 -5.58618206 1.25625865
H  0.69946362 -6.25190722 0.49486692
H  2.05201399 -6.02350009 1.60127409
C  0.14976855 -5.47063903 2.46754001
H  0.54131566 -4.73428135 3.17626422
H  0.17558781 -6.44194446 2.9708895
C  -1.27331238 -5.14739537 2.10938776
H  -1.82533818 -5.93086333 1.58907598
C  -1.89201758 -4.00180351 2.39880829
H  -1.38304233 -3.19734817 2.92577179
H  -2.92830212 -3.83473109 2.11945971
C  -2.65612287 -3.35695514 -1.91128322
H  -2.95943052 -4.33821904 -2.26118143
N  -3.5974022 -2.37935867 -1.86554515
H  -3.41815453 -1.58024891 -1.28581517
C  -4.88510097 0.27470182 -0.27127569
C  -5.7350179 -0.78946605 -0.59466621
C  -6.51807437 -1.35967567 0.41546473
C  -6.4312672 -0.89189692 1.72329621
C  -5.55519499 0.14526738 2.04297443
C  -4.78502496 0.73101903 1.04314706
H  -4.30834229 0.76876109 -1.04887955
H  -7.2045514 -2.1732488 0.20066788
H  -7.04460144 -1.34297559 2.49623207
H  -5.483821 0.50130917 3.06600187
H  -4.11458518 1.55054838 1.27845512
C  -5.74791028 -1.28676362 -2.02794592
H  -5.26554436 -0.53285108 -2.65795966
C  -4.97962933 -2.62812636 -2.25086689
H  -4.98995612 -2.84176444 -3.32782623
C  -5.62442962 -3.83023732 -1.56271546
C  -6.53175678 -4.60603518 -2.29039564
C  -5.35278571 -4.17339361 -0.23378739
C  -7.19461077 -5.67756803 -1.69587373
H  -6.70195983 -4.39383927 -3.34308809
C  -6.00347482 -5.25292038 0.35772873
H  -4.63753662 -3.59239816 0.33897009
C  -6.93320927 -6.00049833 -0.36691612
H  -7.89625786 -6.26645852 -2.27744667
H  -5.7888625 -5.51452915 1.3893212
H  -7.44022016 -6.84055783 0.09630218
C  -8.04036685 -0.22500366 -2.24935273
C  -7.19715299 -1.58868963 -4.09742936
C  -8.98686597 -0.13972283 -3.43275897
H  -7.39521755 0.6532694 -2.18626133
H  -8.51116191 -0.39501689 -1.28326218
C  -8.06681458 -0.44687234 -4.61240323
H  -7.64358088 -2.56304633 -4.29314158
H  -6.18272866 -1.57346666 -4.49174594
H  -9.78309168 -0.88564336 -3.34877207
H  -9.44659145 0.84710976 -3.49359595
H  -8.60197171 -0.74570679 -5.51420382
H  -7.44930881 0.42314763 -4.85228667
N  -7.14470705 -1.41044468 -2.57685954
H  -7.56612205 -2.24439502 -2.15576143
