program: Gaussian 16
title: Title Card Required
version: ES64L-G16RevC.02
basis: 6-31+G(d,p)
method: UwB97XD TD-FC
operation: Force
keyword: #p
keyword: td=(nstates=30,root=3)
keyword: uwb97xd/6-31+g(d,p)
keyword: force
keyword: scrf=(CPCM,solvent=chloroform)
keyword: nosymm
keyword: scf=xqc
keyword: Guess=mix
keyword: density=current
title: #p td=(nstates=30,root=3) uwb97xd/6-31+g(d,p) force scrf=(CPCM,solvent
basis: NPDir=0 NMtPBC= 1 NCelOv= 1 NCel= 1 NClECP= 1 NCelD= 1
basis: NCelK= 1 NCelE2= 1 NClLst= 1 CellRange= 0.0.
basis: One-electron integrals computed using PRISM.
basis: NBasis= 859 RedAO= T EigKep= 1.13D-06 NBF= 859
basis: NBsUse= 854 1.00D-06 EigRej= 8.98D-07 NBFU= 854
converged: NO NO NO NO
hfenergy: -1479.2110432 hartree
pointgroup: C01 [X(C32H35N3O1)]
dipole: -2.3124326 1.9892813 -2.9069597 debye
InChI: InChI=1/32C.3N.O.35H
charge 2 multiplicity 1
71 atoms
C  0.58991146 -2.25143187 -0.51439353
C  -0.62968358 -1.96280114 -1.19946281
C  -0.86379142 -0.66410508 -1.69388024
C  0.08888368 0.31624435 -1.4504524
C  1.26930051 0.01416108 -0.76023883
C  1.54924006 -1.27877102 -0.28541369
C  -0.60031919 -4.15787575 -0.67324091
C  -1.37776961 -3.17691176 -1.31085287
H  -1.7224995 -0.4510348 -2.32440012
H  -0.07863576 1.31371223 -1.82495886
H  2.01349703 0.79728477 -0.62286247
H  2.47843539 -1.48452405 0.22500576
N  0.57395983 -3.61451365 -0.19799142
H  -0.82089578 -5.20861671 -0.56517226
C  1.48715572 -4.23634461 0.70055356
O  2.4804577 -3.62763265 1.04495943
C  1.11541317 -5.58533532 1.25381889
H  0.69890021 -6.25409953 0.49475389
H  2.05152269 -6.0231969 1.60130018
C  0.15055534 -5.46922095 2.46595861
H  0.54129514 -4.73425227 3.17604931
H  0.17636077 -6.44064935 2.97008279
C  -1.27172101 -5.14909145 2.10877102
H  -1.82499312 -5.92985412 1.58964927
C  -1.89316592 -3.99970444 2.40037305
H  -1.38271524 -3.19736001 2.92577595
H  -2.92788642 -3.83499619 2.12021853
C  -2.65180543 -3.35518369 -1.92140284
H  -2.96161799 -4.34540934 -2.24340958
N  -3.5964858 -2.37805792 -1.88871932
H  -3.42519907 -1.58370867 -1.25401154
C  -4.88541332 0.27461017 -0.2712016
C  -5.73385831 -0.79024585 -0.59563071
C  -6.51842407 -1.36015463 0.41528
C  -6.43167503 -0.89153431 1.72300323
C  -5.55546031 0.14547466 2.04341145
C  -4.78537362 0.73101536 1.04260517
H  -4.3091574 0.76998667 -1.04928577
H  -7.20479396 -2.17304773 0.20047968
H  -7.0445311 -1.34301452 2.49637459
H  -5.48389925 0.50148052 3.06624288
H  -4.1145135 1.55061795 1.27873996
C  -5.74767783 -1.28684004 -2.02930446
H  -5.26484741 -0.53213709 -2.65814341
C  -4.98317278 -2.63042963 -2.25691423
H  -4.99664572 -2.8437488 -3.33331134
C  -5.62497493 -3.83060621 -1.56342311
C  -6.5321705 -4.60657322 -2.2910452
C  -5.35232449 -4.17255441 -0.23525674
C  -7.19491684 -5.67838388 -1.69518817
H  -6.7017305 -4.39391797 -3.34276982
C  -6.00275716 -5.25201948 0.35782983
H  -4.63700695 -3.59079786 0.33775235
C  -6.93277471 -6.00013215 -0.366778
H  -7.89591421 -6.26648894 -2.27736827
H  -5.78879669 -5.51429561 1.38905149
H  -7.44004644 -6.84044436 0.0962413
C  -8.04012337 -0.22478096 -2.24914323
C  -7.19737715 -1.5884997 -4.09763802
C  -8.98677461 -0.13968351 -3.43244735
H  -7.39497207 0.65357483 -2.18608647
H  -8.51053432 -0.39526335 -1.28312162
C  -8.06695109 -0.44666561 -4.6122723
H  -7.6436861 -2.56276611 -4.29301816
H  -6.18291302 -1.57325226 -4.49176651
H  -9.78286344 -0.88574817 -3.34842423
H  -9.44681298 0.84697804 -3.49327475
H  -8.60214861 -0.74562793 -5.51402414
H  -7.44945496 0.42328693 -4.85209104
N  -7.14451885 -1.41035742 -2.57711365
H  -7.56598632 -2.24408256 -2.15528616
