program: Gaussian 16
title: Title Card Required
version: ES64L-G16RevC.02
basis: 6-31+G(d,p)
method: UwB97XD TD-FC
operation: Force
keyword: #p
keyword: td=(nstates=30,root=2)
keyword: uwb97xd/6-31+g(d,p)
keyword: force
keyword: scrf=(CPCM,solvent=chloroform)
keyword: nosymm
keyword: scf=xqc
keyword: Guess=mix
keyword: density=current
title: #p td=(nstates=30,root=2) uwb97xd/6-31+g(d,p) force scrf=(CPCM,solvent
basis: NPDir=0 NMtPBC= 1 NCelOv= 1 NCel= 1 NClECP= 1 NCelD= 1
basis: NCelK= 1 NCelE2= 1 NClLst= 1 CellRange= 0.0.
basis: One-electron integrals computed using PRISM.
basis: NBasis= 859 RedAO= T EigKep= 1.05D-06 NBF= 859
basis: NBsUse= 854 1.00D-06 EigRej= 7.29D-07 NBFU= 854
converged: NO NO NO NO
hfenergy: -1479.2115411 hartree
pointgroup: C01 [X(C32H35N3O1)]
dipole: -1.7400693 -0.183521 -3.7345087 debye
InChI: InChI=1/32C.3N.O.35H
charge 2 multiplicity 1
71 atoms
C  0.59343747 -2.25930426 -0.53642276
C  -0.60720185 -1.98348027 -1.26399759
C  -0.87206136 -0.67340473 -1.70680518
C  0.08306354 0.31208374 -1.47600988
C  1.27120222 0.00893984 -0.79324931
C  1.54902962 -1.27806929 -0.30988716
C  -0.58605725 -4.17079041 -0.68136462
C  -1.35818107 -3.20188945 -1.3409904
H  -1.80178957 -0.42766449 -2.2085358
H  -0.09388662 1.32571538 -1.81541455
H  1.99835547 0.79480194 -0.62189056
H  2.46796232 -1.4943561 0.21460766
N  0.55614421 -3.59843762 -0.15286139
H  -0.80455677 -5.2171636 -0.55992938
C  1.47816078 -4.22537626 0.72983913
O  2.48153179 -3.62693239 1.05313471
C  1.11172693 -5.58346058 1.26967873
H  0.70021099 -6.23774647 0.49679501
H  2.05128403 -6.02350237 1.60598889
C  0.14327419 -5.47901795 2.47778399
H  0.53421659 -4.74134722 3.18569997
H  0.1682004 -6.45207369 2.97863483
C  -1.27738249 -5.15403373 2.11157494
H  -1.8270504 -5.93600926 1.58705366
C  -1.89530475 -4.0037567 2.39309092
H  -1.38670219 -3.20244646 2.92386568
H  -2.92856503 -3.83334378 2.10702336
C  -2.67224086 -3.37628177 -1.84729449
H  -3.33751808 -4.11268592 -1.40984721
N  -3.12170249 -2.69339901 -2.9292071
H  -2.44287812 -2.26012418 -3.5415145
C  -3.0055375 -0.10821627 -5.00472075
C  -4.24893216 -0.54216219 -4.53576172
C  -5.08813868 0.37131664 -3.88823613
C  -4.67889841 1.68727129 -3.69824376
C  -3.4247748 2.10461254 -4.14285349
C  -2.58900964 1.20554106 -4.80005853
H  -2.35701906 -0.79402747 -5.54538476
H  -6.06503526 0.0718739 -3.52192166
H  -5.34124861 2.38633006 -3.19942757
H  -3.10789204 3.13055613 -3.98856812
H  -1.6196645 1.5257654 -5.16706092
C  -4.61128067 -2.00027409 -4.71480901
H  -3.93314866 -2.43951159 -5.45314059
C  -4.48325919 -2.84204494 -3.4057756
H  -4.64125055 -3.89473267 -3.67888972
C  -5.50502277 -2.49414019 -2.3344229
C  -6.71615737 -3.19005772 -2.29902606
C  -5.2682529 -1.49036852 -1.39024223
C  -7.69960199 -2.8574177 -1.36832787
H  -6.88738143 -4.02091474 -2.97837046
C  -6.24311087 -1.16767522 -0.45198031
H  -4.32275134 -0.95930437 -1.39093624
C  -7.46482618 -1.8418952 -0.4456186
H  -8.63619536 -3.40473769 -1.35592657
H  -6.04960117 -0.38682526 0.27590357
H  -8.22328134 -1.5863281 0.28683254
C  -6.27474033 -1.24712444 -6.47538981
C  -6.25984607 -3.60434451 -5.81889277
C  -7.21562381 -2.03940782 -7.36428895
H  -5.32234499 -1.05395814 -6.97239517
H  -6.67303438 -0.31219718 -6.08723745
C  -6.62940518 -3.44806941 -7.29093434
H  -7.08661495 -4.00173181 -5.23136162
H  -5.37650378 -4.21880309 -5.65521925
H  -8.23671648 -2.01472541 -6.9720719
H  -7.22805529 -1.63331007 -8.37635143
H  -7.32967475 -4.22523318 -7.59866535
H  -5.73707843 -3.52324049 -7.91808316
N  -5.98416085 -2.18458789 -5.31022283
H  -6.66872195 -1.98763356 -4.5728431
