program: Gaussian 16
title: Title Card Required
version: ES64L-G16RevC.02
basis: 6-31+G(d,p)
method: UwB97XD TD-FC
operation: Force
keyword: #p
keyword: td=(nstates=40,root=3)
keyword: uwb97xd/6-31+g(d,p)
keyword: force
keyword: scrf=(CPCM,solvent=chloroform)
keyword: nosymm
keyword: scf=xqc
keyword: Guess=mix
keyword: density=current
title: #p td=(nstates=40,root=3) uwb97xd/6-31+g(d,p) force scrf=(CPCM,solvent
basis: NPDir=0 NMtPBC= 1 NCelOv= 1 NCel= 1 NClECP= 1 NCelD= 1
basis: NCelK= 1 NCelE2= 1 NClLst= 1 CellRange= 0.0.
basis: One-electron integrals computed using PRISM.
basis: NBasis= 859 RedAO= T EigKep= 1.12D-06 NBF= 859
basis: NBsUse= 854 1.00D-06 EigRej= 7.47D-07 NBFU= 854
converged: NO NO NO NO
hfenergy: -1479.2174629 hartree
pointgroup: C01 [X(C32H35N3O1)]
dipole: -2.6092788 -0.6273943 -3.9341177 debye
InChI: InChI=1/32C.3N.O.35H
charge 2 multiplicity 1
71 atoms
C  0.61258042 -2.25563931 -0.52102805
C  -0.55665763 -1.98673176 -1.29272159
C  -0.76879137 -0.66530088 -1.79223565
C  0.1840585 0.30190908 -1.56432448
C  1.33014903 -0.00866141 -0.82473554
C  1.56276385 -1.29742029 -0.28924944
C  -0.56928852 -4.15644835 -0.65677453
C  -1.31160052 -3.18661684 -1.38722822
H  -1.66927971 -0.39529712 -2.33059009
H  0.03737391 1.30812979 -1.94003899
H  2.06872662 0.76181618 -0.63762572
H  2.45705306 -1.50592188 0.27944407
N  0.55807679 -3.60607599 -0.11131508
H  -0.8236224 -5.19170535 -0.51634035
C  1.45434045 -4.20929617 0.7926248
O  2.42724381 -3.5866414 1.17367348
C  1.11674739 -5.58765775 1.29905227
H  0.71550331 -6.23689464 0.51626176
H  2.06401066 -6.01752665 1.62925319
C  0.14974284 -5.51530165 2.5103247
H  0.5384659 -4.78689226 3.22912689
H  0.17736745 -6.49657252 2.99465372
C  -1.26963574 -5.18749042 2.14674785
H  -1.82331768 -5.96689435 1.62283566
C  -1.88234606 -4.0330 2.4283839
H  -1.36731808 -3.23448908 2.95771625
H  -2.9164297 -3.85851293 2.14802253
C  -2.57467445 -3.42504744 -2.00510769
H  -3.0918631 -4.35494335 -1.80173224
N  -3.12724366 -2.63518253 -2.95342671
H  -2.68767042 -1.75812986 -3.19862001
C  -3.02457855 -0.11298119 -5.00732173
C  -4.27437933 -0.54246674 -4.54875205
C  -5.11180049 0.36979502 -3.89671175
C  -4.69843234 1.68250382 -3.69776396
C  -3.44111789 2.09758672 -4.13612554
C  -2.60488323 1.19924282 -4.7933293
H  -2.37499438 -0.80395777 -5.53862536
H  -6.08868188 0.06958419 -3.53061571
H  -5.3583141 2.38027722 -3.19377592
H  -3.12099117 3.12125257 -3.97413225
H  -1.63145872 1.51700543 -5.15123171
C  -4.63644551 -2.00178503 -4.72137678
H  -3.95428947 -2.44868446 -5.44983199
C  -4.49536604 -2.81756384 -3.39622679
H  -4.61284007 -3.87958678 -3.64350975
C  -5.53060979 -2.47662646 -2.33022195
C  -6.73894236 -3.17926413 -2.30046056
C  -5.30428682 -1.47510569 -1.3819551
C  -7.7251808 -2.85708683 -1.36896619
H  -6.9064166 -4.00776165 -2.98401674
C  -6.28390366 -1.15894903 -0.4460294
H  -4.36367001 -0.93476473 -1.37352397
C  -7.50010984 -1.84171397 -0.44325502
H  -8.65704898 -3.41214969 -1.35761129
H  -6.09698202 -0.37781984 0.28333875
H  -8.26174592 -1.59358791 0.28825708
C  -6.29031102 -1.25368372 -6.48643185
C  -6.2837336 -3.60712029 -5.81609921
C  -7.22917322 -2.04809232 -7.37493256
H  -5.3344633 -1.06834135 -6.97984503
H  -6.68606545 -0.31444165 -6.10606972
C  -6.64639792 -3.45781104 -7.29117609
H  -7.11398977 -4.00090266 -5.23115999
H  -5.40076355 -4.22016289 -5.64351383
H  -8.2516783 -2.01833316 -6.98679467
H  -7.23632299 -1.64708765 -8.38915145
H  -7.34764523 -4.23434973 -7.59823452
H  -5.75167801 -3.53845969 -7.91441755
N  -6.00875779 -2.18546357 -5.31447903
H  -6.69508482 -1.98299524 -4.58032618
